program: Gaussian 09
title: 000118056
version: EM64L-G09RevD.01
frameworkgroup: C1[X(C16H24N2O)]
method: RPBEPBE
basis: SDD
operation: Freq
keyword: #p
keyword: freq=noraman
keyword: PBEPBE/SDD
title: #p freq=noraman PBEPBE/SDD
converged: YES YES NO NO
title: Mulliken charges:
elementType: O N N C C C C C C C C C C C C C C C C H H H H H H H H H H H H H H H H H H H H H H H H
charge: -0.319303 -0.382476 -0.084385 -0.232542 0.160468 0.383795 -0.408299 -0.366469 -0.487288 -0.236115 0.553199 -0.415247 -0.415959 -0.404216 -0.463092 -0.695304 -0.693900 -0.257288 -0.666207 0.229713 0.204524 0.218846 0.217501 0.216215 0.227044 0.208003 0.325363 0.206638 0.266590 0.274205 0.225665 0.227809 0.209370 0.226043 0.211186 0.208896 0.211143 0.227410 0.214885 0.204918 0.213726 0.224358 0.230578
chargesum: 0.00000
title: Mulliken charges with hydrogens summed into heavy atoms:
elementType: O N N C C C C C C C C C C C C C C C C
charge: -0.319303 -0.057113 -0.084385 -0.002829 0.160468 0.383795 0.015071 0.067247 -0.052242 -0.029478 0.553199 -0.148657 -0.141754 -0.178551 -0.235282 -0.048705 -0.046451 0.162515 0.002455
polarizability: 2.33428791e+02 4.18088376e+00 1.73706897e+02 -4.56985980e+00 1.54592343e+01 1.59820909e+02
1716.lowfreq: -16.5038 -5.6463 -3.4377 -0.0009 -0.0004 -0.0003 11.0825 28.7393 35.0575
frequency: -8.5610 28.2115 35.0418 47.8979 55.5565 70.6080 95.0170 110.4967 144.4610 177.5019 191.6712 202.2703 209.7156 212.6121 226.5883 251.2661 253.8102 302.9257 322.8588 347.2253 378.6942 408.5012 422.0067 456.5646 469.1023 503.9438 507.7613 540.8919 550.7183 578.2281 635.3246 648.4102 706.0818 725.5651 764.7137 797.7242 810.5837 833.4726 839.7733 858.0368 861.8978 877.4553 884.3835 889.9032 914.6836 917.9151 952.6827 962.0731 970.1136 978.4825 985.7408 1014.7902 1042.9355 1050.6217 1072.7243 1084.4551 1106.8068 1112.1752 1113.9408 1136.4148 1155.0641 1156.3802 1180.1588 1188.4319 1190.3565 1203.8337 1220.2375 1231.3312 1265.2700 1266.0657 1268.1507 1293.4150 1304.2137 1308.4564 1315.0976 1331.7059 1333.6330 1350.6114 1353.6500 1375.9901 1385.3240 1387.0477 1395.3271 1408.4900 1456.6793 1460.5518 1463.3204 1465.8733 1467.5713 1469.2782 1472.5031 1477.7956 1484.1629 1484.7987 1501.7967 1505.6011 1581.9650 1619.6335 1627.5022 2952.2857 2961.5153 2967.9665 2972.3544 2974.9639 2977.3039 2986.6509 2996.1446 3001.4026 3029.2933 3035.7519 3056.9086 3064.9135 3065.0509 3071.7837 3076.0013 3080.4862 3080.5424 3098.6879 3113.4691 3115.7112 3139.8514 3169.6797 3541.1717
redmass: 2.8714 2.9638 3.7677 3.2542 3.5056 3.1179 3.2305 2.4590 3.0207 2.7835 2.6788 2.4703 1.5085 1.6676 2.3121 1.1712 2.2275 2.1297 2.6911 4.0392 3.9603 2.9211 2.9854 4.4987 2.9629 2.9638 3.8059 1.2984 2.5561 2.8000 6.9990 4.8107 2.7542 3.3023 3.6337 1.1572 3.6179 2.4191 3.0412 1.3402 1.5973 1.9114 2.3514 2.5598 2.7861 1.1912 1.4597 3.0838 1.6293 2.1091 1.3611 3.0178 4.8497 1.5646 2.2912 2.0579 2.1022 1.5388 2.4563 3.5603 1.7584 1.7028 1.3976 1.1970 1.2998 1.5964 1.8956 2.0543 1.2863 1.3517 1.2445 1.5811 1.4112 1.3227 1.2202 1.4496 1.4005 1.4100 1.2470 1.1967 1.9518 1.7234 1.2805 2.5200 1.1386 1.1248 1.0474 1.0460 1.0498 1.0649 1.3200 1.0491 1.0659 1.1215 1.4319 2.1518 6.8538 6.3578 6.5599 1.0666 1.0674 1.0644 1.0348 1.0385 1.0807 1.0377 1.0622 1.0823 1.0955 1.0934 1.0987 1.1041 1.1001 1.0993 1.1004 1.0993 1.0979 1.1019 1.0893 1.0875 1.0962 1.0935 1.0775
irintensity: 1.3771 0.1513 0.3969 2.8804 0.1475 1.0668 0.2555 1.6907 1.6597 4.5677 2.1799 3.5239 1.8332 3.8094 0.9006 0.2173 5.6992 11.8666 5.3574 4.6492 1.4013 0.1342 4.8679 7.2054 2.6021 8.5632 3.0799 103.1334 18.4462 1.2767 0.1518 4.5716 29.9247 1.7523 7.4175 6.7062 6.2577 17.8790 8.8179 3.1589 13.6133 3.7569 1.7427 2.5437 21.9445 4.5993 0.0156 15.2903 4.6883 2.3066 0.2818 20.9782 135.9020 42.4107 8.5559 22.3652 1.1356 7.6348 2.0801 21.9240 2.7437 18.3438 10.7621 7.3173 5.3234 1.9899 5.1733 6.4646 4.5086 6.9079 8.8908 6.4387 12.8018 0.8999 28.5003 3.0683 20.8831 32.3835 9.8624 15.6259 13.4046 22.8478 7.0464 10.8994 34.2409 5.5604 12.6268 4.7755 0.9234 0.7868 37.6231 15.1172 10.6740 3.7606 58.9929 44.4819 1.1593 49.5054 91.3021 53.0038 66.6339 53.3403 33.1104 40.8848 19.8983 15.5604 20.9303 16.2310 43.3024 68.5781 10.6003 49.3243 1.6442 112.7148 25.7141 66.6647 23.8156 39.8432 22.7987 16.6846 10.9569 4.3466 33.9903
temp: 298.150 k
press: 1.00000 atm
elementType: 8 7 7 6 6 6 6 6 6 6 6 6 6 6 6 6 6 6 6 1 1 1 1 1 1 1 1 1 1 1 1 1 1 1 1 1 1 1 1 1 1 1 1
symmnumber: 1
zpe: 972499.3 jmol-1
zpe.correction: 0.370405 hartree
zpe.thermalcorrener: 0.389544 hartree
zpe.thermalcorrenthalpy: 0.390488 hartree
zpe.thermalcorrgfe: 0.322050 hartree
zpe.sumelectzpe: -807.356928 hartree
zpe.sumelectthermal: -807.337789 hartree
zpe.sumelectthermalent: -807.336845 hartree
zpe.sumelectthermalfe: -807.405283 hartree
dipole: 1.7889 -0.5790 2.1280
dipole: 2.8397
quadrupole: -100.6232 -108.8352 -115.6518
quadrupole: 0.8508 4.8485 -0.6749
quadrupole: 7.7469 -0.4651 -7.2817 0.8508 4.8485 -0.6749
hfenergy: -807.7273335 hartree
pointgroup: C01 [X(C16H24N2O1)]
dipole: -0.5987635 0.5512254 0.7653873 debye
polarizability: 233.2559613|1.7611935|160.3751771|-5.4374669|-16.2006319|173.3254588 unknown
InChI: InChI=1S/C16H24N2O/c1-4-19-15(16-17-10-5-11-18-16)14-8-6-13(7-9-14)12(2)3/h6-9,12,15,17H,4-5,10-11H2,1-3H3
charge 0 multiplicity 1
43 atoms
O  -1.528307 -1.386651 1.534495
N  -2.207534 1.239737 1.000535
N  -2.478391 0.61773 -1.322342
C  -1.239776 -0.874505 0.185225
C  -2.050759 0.403069 -0.095499
C  0.265547 -0.609937 0.087712
C  -3.87889 2.485252 -0.299953
C  -2.877087 2.543028 0.878323
C  -3.181835 1.910557 -1.5600
C  4.573251 0.176433 -0.289358
C  3.071655 -0.096638 -0.161952
C  0.808499 -0.147978 -1.138465
C  1.13164 -0.818962 1.184341
C  2.1901 0.102591 -1.25846
C  2.516744 -0.561333 1.055216
C  4.857509 1.665833 -0.622288
C  5.237355 -0.757184 -1.336772
C  -2.862239 -2.013348 1.661585
C  -2.923701 -3.415873 1.03752
H  -1.53692 -1.605426 -0.591892
H  -4.283048 3.494308 -0.501119
H  -4.726023 1.829837 -0.021817
H  -2.13341 3.348035 0.700009
H  -3.400306 2.779525 1.823457
H  -3.922831 1.747889 -2.36384
H  -2.448289 2.646352 -1.952344
H  -1.851089 0.903383 1.896888
H  5.036122 -0.041704 0.694654
H  0.13555 0.022823 -1.987127
H  0.71604 -1.190939 2.124796
H  2.586014 0.457379 -2.218063
H  3.177931 -0.728164 1.915477
H  5.946498 1.854828 -0.668593
H  4.419437 2.335183 0.139928
H  4.424437 1.941095 -1.602048
H  6.328254 -0.578888 -1.382283
H  4.823153 -0.577989 -2.346594
H  5.0683 -1.820137 -1.087141
H  -3.028846 -2.067108 2.75157
H  -3.633678 -1.347701 1.221176
H  -3.909927 -3.875081 1.239062
H  -2.787566 -3.385613 -0.057856
H  -2.141881 -4.064906 1.468645
