program: Gaussian 09
title: 000117898
version: EM64L-G09RevD.01
frameworkgroup: C1[X(C14H10O4)]
method: RPBEPBE
basis: SDD
operation: Freq
keyword: #pfreq=noraman
keyword: PBEPBE/SDD
title: #p freq=noraman PBEPBE/SDD
converged: NO YES NO NO
title: Mulliken charges:
elementType: O O O O C C C C C C C C C C C C C C H H H H H H H H H H
charge: -0.214034 -0.177710 -0.169354 -0.155299 0.086665 0.299590 0.083476 0.151959 -0.214008 0.295019 -0.066016 -0.470033 0.227547 -0.313146 -0.770601 0.370411 -0.791606 -0.662179 0.291162 0.283927 0.253848 0.222791 0.253846 0.235393 0.235371 0.235374 0.222005 0.255602
chargesum: 0.00000
title: Mulliken charges with hydrogens summed into heavy atoms:
elementType: O O O O C C C C C C C C C C C C C C
charge: -0.214034 -0.177710 -0.169354 -0.155299 0.086665 0.299590 0.083476 0.151959 -0.214008 0.295019 -0.066016 -0.178871 0.227547 -0.029219 -0.040117 0.370411 -0.085467 -0.184572
polarizability: 2.96263470e+02 -1.16476723e+01 1.89172869e+02 7.62058117e-03 -2.10705087e-03 7.21917394e+01
1716.lowfreq: -0.0009 -0.0006 0.0004 6.4472 7.2512 8.3815 50.8975 59.8727 99.8203
frequency: 50.8963 59.8619 99.8153 108.0517 109.1586 118.5337 175.7834 178.1458 182.0058 190.4295 250.3051 267.9046 281.1950 302.0994 313.1279 369.3539 413.5207 453.4057 481.8803 484.8071 503.3299 544.6793 594.7583 618.5453 619.9682 627.6910 652.0217 711.3649 737.1035 745.2080 777.1314 804.5462 816.5624 872.3307 890.8153 913.9875 942.9191 963.8199 970.3055 1002.6413 1005.4216 1044.4990 1054.6261 1055.5280 1067.1028 1096.9062 1144.5542 1190.0883 1239.6849 1263.4983 1305.4310 1332.1216 1398.0634 1400.6165 1412.9662 1416.2242 1429.0670 1458.3678 1467.1965 1467.6140 1477.5599 1487.3959 1493.5744 1533.3134 1549.6614 1571.0590 1600.1443 1638.3280 2979.9549 2995.3717 3058.3838 3079.9300 3098.5933 3102.7318 3110.1537 3221.4478 3239.5460 3257.9499
redmass: 5.6056 3.0460 2.2274 8.3245 4.1791 1.4444 5.9563 1.1142 3.8261 4.2625 4.6924 5.4145 6.8845 4.5349 8.1130 4.7324 4.4608 6.3389 3.6720 4.5594 6.4469 9.0145 3.9075 4.4302 1.8410 5.7722 5.4132 7.6385 4.1726 1.9957 1.4119 8.0634 4.5558 1.7163 6.5830 5.7984 2.6790 1.3281 3.4802 1.4919 1.6495 1.4904 6.3650 1.4928 7.7202 2.3843 2.0301 2.3638 2.4911 4.7760 5.0502 7.5684 1.2915 2.1945 1.6253 2.0966 2.4752 1.0428 1.0445 1.2660 1.1802 7.9603 5.3360 5.6721 5.3197 11.7101 10.1192 5.1838 1.0376 1.0364 1.0980 1.0973 1.1009 1.0983 1.0614 1.1157 1.0982 1.1003
irintensity: 4.2791 0.0058 0.3052 2.4525 0.8427 0.1486 0.6739 0.1524 0.6268 1.7708 1.2629 1.0537 4.8358 0.0875 7.4433 4.1286 1.0295 1.1110 2.3100 3.3284 0.1210 2.6918 10.3715 2.9530 1.8907 1.2761 4.5796 6.4884 1.0703 1.2345 36.3269 1.8259 5.7408 23.4210 4.5999 139.2624 1.8479 68.5840 66.2770 1.8693 5.0573 6.3451 1.3917 4.7302 1.1735 3.9858 3.6421 30.4148 13.5101 81.9567 201.0237 8.6360 15.5849 45.7379 3.9946 8.9602 18.5439 15.0399 17.2648 13.5600 1.4438 89.2916 355.3834 8.1331 6.3710 321.9141 8.2054 15.5834 20.2558 15.6807 18.5330 9.0007 23.8986 20.3490 1.7587 8.4923 6.2544 0.8013
temp: 298.150 k
press: 1.00000 atm
elementType: 8 8 8 8 6 6 6 6 6 6 6 6 6 6 6 6 6 6 1 1 1 1 1 1 1 1 1 1
symmnumber: 1
zpe: 532007.4 jmol-1
zpe.correction: 0.202631 hartree
zpe.thermalcorrener: 0.218308 hartree
zpe.thermalcorrenthalpy: 0.219252 hartree
zpe.thermalcorrgfe: 0.159647 hartree
zpe.sumelectzpe: -839.084354 hartree
zpe.sumelectthermal: -839.068677 hartree
zpe.sumelectthermalent: -839.067733 hartree
zpe.sumelectthermalfe: -839.127338 hartree
dipole: -0.3205 -3.1463 -0.0004
dipole: 3.1626
quadrupole: -69.9001 -120.6401 -104.3872
quadrupole: 2.5781 0.0020 -0.0032
quadrupole: 28.4091 -22.3310 -6.0781 2.5781 0.0020 -0.0032
hfenergy: -839.2869851 hartree
pointgroup: C01 [X(C14H10O4)]
dipole: 0.1353721 1.2368758 0.000902 debye
polarizability: 296.0826839|-12.4497072|189.3535571|0.056807|0.0955222|72.1918371 unknown
InChI: InChI=1S/C14H10O4/c1-6(2)9-4-8-11(15)10-7(3)5-17-14(10)12(16)13(8)18-9/h4-5H,1H2,2-3H3
charge 0 multiplicity 1
28 atoms
O  1.946308 -1.040342 0.000429
O  -3.00593 -1.68242 -0.001585
O  -1.040865 2.605585 0.002223
O  -0.324857 -2.970802 -0.001872
C  -2.0094 0.375859 0.00012
C  0.44858 0.69018 0.001113
C  0.593335 -0.705131 0.000085
C  -1.786695 -1.008386 -0.000857
C  -0.886039 1.344118 0.001031
C  -3.444809 0.588122 -0.000017
C  -0.485148 -1.713393 -0.001124
C  1.768712 1.251003 0.002208
C  2.674109 0.182917 0.001743
C  -4.004186 -0.684869 -0.001091
C  -4.174199 1.903004 0.000816
C  4.133246 0.122275 0.002183
C  4.849802 1.4622 0.003971
C  4.79593 -1.073219 0.000866
H  2.013256 2.31047 0.003215
H  -5.027296 -1.050987 -0.001585
H  -3.897454 2.505358 -0.882242
H  -5.267368 1.754972 0.000345
H  -3.898031 2.50392 0.885036
H  4.583886 2.060646 -0.887735
H  4.581888 2.059397 0.895896
H  5.94201 1.31613 0.005033
H  5.890421 -1.106573 0.001196
H  4.256893 -2.025835 -0.0006
