program: Gaussian 09
title: 000117745
version: EM64L-G09RevD.01
frameworkgroup: C1[X(C6H10N2O2)]
method: RPBEPBE
basis: SDD
operation: Freq
keyword: #p
keyword: freq=noraman
keyword: PBEPBE/SDD
title: #p freq=noraman PBEPBE/SDD
converged: YES YES NO NO
title: Mulliken charges:
elementType: O O N N C C C C C C H H H H H H H H H H
charge: -0.268728 -0.261019 -0.170441 0.091414 -0.462396 -0.392306 -0.518777 0.438498 -0.652862 -0.322907 0.241903 0.241677 0.236182 0.236237 0.275148 0.274550 0.251429 0.237491 0.251538 0.273370
chargesum: 0.00000
title: Mulliken charges with hydrogens summed into heavy atoms:
elementType: O O N N C C C C C C
charge: -0.268728 -0.261019 -0.170441 0.091414 0.021184 0.080113 0.030921 0.438498 0.087597 -0.049537
polarizability: 1.39437465e+02 -4.28022652e-01 9.17909762e+01 -1.53241819e-02 -2.83936238e-02 5.18812692e+01
1716.lowfreq: -116.9914 0.0003 0.0006 0.0009 7.6478 10.2624 13.8241 55.8837 109.5522
frequency: -116.9794 55.8825 109.5493 119.0753 165.9408 168.2495 241.3233 267.9189 371.8888 442.4186 522.6148 599.5435 668.5041 676.8697 710.2423 766.0750 780.3325 817.5769 902.6116 923.8526 943.6297 1001.1129 1059.7035 1070.5167 1109.4851 1111.5883 1172.4017 1206.9367 1230.6801 1238.1952 1240.1275 1254.0921 1296.0425 1310.7438 1320.7228 1375.5118 1419.6982 1445.6638 1467.2317 1470.3499 1483.8881 1495.2473 1504.6585 1620.6409 2964.6495 2974.0589 3017.8023 3033.2884 3038.7047 3046.1686 3080.7162 3103.1195 3109.0964 3207.6691
redmass: 1.6417 3.7106 1.4016 3.3399 2.2329 5.0377 3.7099 4.4257 6.3059 4.3173 2.4814 4.8551 8.3075 4.5309 6.3628 1.2617 1.3928 4.6843 1.3514 4.6709 2.8560 2.8348 3.4975 1.6523 1.2918 1.9937 1.2030 1.1436 2.6024 1.1180 2.7713 1.8192 1.7595 1.7919 2.9893 2.1322 1.6838 1.1339 1.5120 1.0408 1.0845 1.1650 1.1839 5.9861 1.0385 1.0559 1.1070 1.0606 1.1012 1.0640 1.1032 1.1033 1.0978 1.0914
irintensity: 0.7914 0.2181 0.1892 0.0950 1.6878 3.5604 7.1356 3.2147 1.6575 0.6559 1.7197 1.3614 5.3845 0.2432 8.7582 14.3531 56.5052 4.4150 1.1614 6.9964 3.7803 21.3555 5.6451 0.0017 0.2841 23.8820 0.5286 0.2480 260.4019 0.3511 36.4665 171.6511 94.7939 17.3131 90.7004 27.0025 18.3910 24.9028 6.8988 14.2569 12.9309 11.9906 7.0955 470.1214 30.0013 95.3200 24.3299 35.8369 25.5441 5.4171 3.0294 25.7689 12.1554 3.9927
temp: 298.150 k
press: 1.00000 atm
elementType: 8 8 7 7 6 6 6 6 6 6 1 1 1 1 1 1 1 1 1 1
symmnumber: 1
zpe: 423086.9 jmol-1
zpe.correction: 0.161145 hartree
zpe.thermalcorrener: 0.170449 hartree
zpe.thermalcorrenthalpy: 0.171393 hartree
zpe.thermalcorrgfe: 0.125931 hartree
zpe.sumelectzpe: -493.718093 hartree
zpe.sumelectthermal: -493.708789 hartree
zpe.sumelectthermalent: -493.707845 hartree
zpe.sumelectthermalfe: -493.753308 hartree
dipole: -8.9685 1.4985 0.0042
dipole: 9.0928
quadrupole: -72.9172 -55.0102 -58.5114
quadrupole: 0.1465 -0.0078 0.0054
quadrupole: -10.7709 7.1360 3.6349 0.1465 -0.0078 0.0054
hfenergy: -493.8792388 hartree
pointgroup: C01 [X(C6H10N2O2)]
dipole: 3.5754116 0.0334117 -0.1144659 debye
dipolederiv: -0.6433486 -0.0908818 0.0078929 -0.3575686 -0.8796707 -0.0191585 -0.0052578 -0.0275667 -0.2579057 -1.0184416 0.2855882 0.0376999 0.4043265 -0.6506076 -0.0311657 0.0433859 -0.0274112 -0.2832903 -1.4496439 0.0044271 0.0387894 -0.2523341 -0.4965601 -0.0031958 0.0206741 -0.0112931 -0.268991 2.0767076 -0.0876674 -0.0650649 0.2747065 1.1703629 0.0398347 -0.047027 0.0515288 0.1873698 -0.0789953 -0.0379347 0.005105 -0.0326531 0.0520198 -0.0033952 0.0064292 -0.0044973 0.1512477 0.4981368 -0.2050611 -0.0164333 -0.4189043 0.2254035 0.0100974 -0.0256822 0.0032665 0.3173062 0.132103 -0.0925935 -0.0052165 -0.0010315 -0.1896705 -0.0139154 0.0005173 -0.0113606 0.100835 1.7926439 -0.0086709 -0.0534955 -0.3087112 0.2756894 0.0168193 -0.0672167 0.0078399 0.1374787 0.1809237 0.0756097 0.0057701 0.3354617 0.3952826 -0.0038879 0.0188709 0.0047146 0.2407626 -1.4752983 -0.0444853 0.0351377 0.3052867 -0.1194279 -0.0001458 0.0515956 0.0109609 -0.3208356 0.0471854 0.044744 -0.0383615 0.0453955 -0.0175561 0.0778487 -0.0690458 0.1235603 -0.0351913 0.0540243 0.0345808 0.036164 0.0359124 -0.0010525 -0.0774843 0.0665822 -0.1225004 -0.0579191 -0.1196154 0.0218336 -0.0877472 0.0542664 0.0388469 -0.0314757 -0.1683887 -0.0123563 -0.0658438 -0.1014551 0.0147887 0.0916976 0.0422575 0.0330904 0.039025 0.1765058 0.0210412 -0.0806162 0.0177691 -0.0016533 0.0530567 0.009841 0.0669771 0.0351425 0.0514611 0.040148 0.0049999 0.0108996 0.002645 -0.053576 0.013362 0.0730017 -0.0295492 -0.0516942 -0.0337749 0.0031446 0.0851457 0.0777554 -0.0916518 -0.0583989 -0.0342811 0.0478217 -0.016869 0.094295 -0.0478028 -0.1282649 -0.0565185 0.0052609 0.0138742 0.0903948 -0.0018505 0.0086836 0.0004648 0.1205806 0.0917555 0.0632735 0.0888186 -0.0614909 -0.0208172 -0.0414284 0.0022414 -0.095676 -0.0669889 0.0277684 0.0002206 0.0061538 -0.0435978 -0.0114253 -0.0099368 0.0042343 -0.0113837 0.2216596 unknown
polarizability: 138.3052482|-6.840637|92.7166058|-3.1039926|2.2035064|52.0878562 unknown
InChI: InChI=1S/C6H10N2O2/c1-7-4-2-3-6(7)5-8(9)10/h5H,2-4H2,1H3
charge 0 multiplicity 1
20 atoms
O  -2.445379 -0.87356 0.065101
O  -3.137818 1.310001 0.194786
N  1.540833 0.533536 0.007806
N  -2.194704 0.410514 0.120207
C  1.793919 -1.852565 -0.111947
C  2.586143 -0.514473 -0.079441
C  0.28234 -1.466869 -0.050479
C  0.256043 0.049327 0.024912
C  1.880485 1.95714 0.063507
C  -0.85265 0.885506 0.10066
H  2.071281 -2.490843 0.7426
H  2.018301 -2.417266 -1.031365
H  3.263376 -0.446126 0.794216
H  3.197548 -0.363011 -0.990451
H  -0.241744 -1.897204 0.818341
H  -0.290266 -1.811106 -0.927118
H  1.445968 2.504753 -0.79524
H  2.974993 2.07474 0.033884
H  1.503495 2.421166 0.995526
H  -0.786363 1.971639 0.151198
