program: Gaussian 09
title: 000117718
version: EM64L-G09RevD.01
frameworkgroup: C1[X(C3H10ClNSi)]
method: RPBEPBE
basis: SDD
operation: Freq
keyword: #p
keyword: freq=noraman
keyword: PBEPBE/SDD
title: #p freq=noraman PBEPBE/SDD
converged: NO YES NO NO
title: Mulliken charges:
elementType: Cl Si N C C C H H H H H H H H H H
charge: -0.357126 0.948425 -0.506227 -1.035758 -0.568096 -0.557545 -0.063176 0.251415 0.268519 0.263479 0.227704 0.224390 0.228876 0.222658 0.223896 0.228567
chargesum: 0.00000
title: Mulliken charges with hydrogens summed into heavy atoms:
elementType: Cl Si N C C C
charge: -0.357126 0.885249 -0.506227 -0.252345 0.112874 0.117576
polarizability: 8.39252667e+01 1.63453230e+00 7.05414036e+01 -1.42671114e+00 -1.46620114e+00 6.15750273e+01
1716.lowfreq: -7.2766 -0.0023 -0.0020 0.0027 7.6390 21.7733 56.4637 95.8670 152.5893
frequency: 56.1805 95.7504 152.5647 176.3526 178.4312 190.2197 194.9172 303.0750 340.7975 372.8247 406.8661 622.5648 668.6401 751.5444 786.1693 893.0130 907.8775 994.3016 1062.8019 1087.6845 1136.7957 1180.9904 1282.3387 1321.9098 1425.5044 1437.0954 1444.8174 1454.9337 1460.8254 1469.9423 1482.4498 1500.2049 2161.1713 2934.8326 2939.5166 2998.4879 3008.0217 3012.3590 3074.0475 3081.3806 3105.5925 3107.1439
redmass: 2.8367 3.1223 1.3030 2.0028 1.1709 1.4898 1.6617 3.5951 3.1641 2.8718 7.8417 3.5982 1.3710 2.0911 1.2494 1.3398 1.3073 2.4294 1.3996 1.2203 1.3819 5.2090 2.4281 1.1914 1.1260 1.0521 1.1140 1.0796 1.0455 1.0449 1.0483 1.0580 1.0425 1.0376 1.0377 1.0345 1.0979 1.0994 1.0978 1.0968 1.0990 1.0979
irintensity: 1.2029 4.4627 0.3749 3.0689 0.0430 0.0138 1.4399 8.1331 7.1022 7.0834 76.0225 20.9569 14.8069 57.7288 50.4827 130.5735 71.0800 139.0105 9.7836 0.5272 0.0642 57.4039 31.1789 40.4841 5.9926 8.6003 4.9281 6.6288 6.4780 20.8328 26.0866 7.2657 97.9518 60.5456 119.9317 4.6650 91.4810 3.7618 22.2933 33.0503 8.3254 6.9807
temp: 298.150 k
press: 1.00000 atm
elementType: 17 14 7 6 6 6 1 1 1 1 1 1 1 1 1 1
symmnumber: 1
zpe: 336527.1 jmol-1
zpe.correction: 0.128176 hartree
zpe.thermalcorrener: 0.137738 hartree
zpe.thermalcorrenthalpy: 0.138683 hartree
zpe.thermalcorrgfe: 0.093328 hartree
zpe.sumelectzpe: -924.046360 hartree
zpe.sumelectthermal: -924.036798 hartree
zpe.sumelectthermalent: -924.035854 hartree
zpe.sumelectthermalfe: -924.081209 hartree
dipole: 3.0256 2.0390 -0.5339
dipole: 3.6874
quadrupole: -54.9383 -52.5403 -52.3006
quadrupole: -5.1472 2.5816 1.5979
quadrupole: -1.6786 0.7194 0.9591 -5.1472 2.5816 1.5979
hfenergy: -924.1745367 hartree
pointgroup: C01 [X(C3H10Cl1N1Si1)]
dipole: 0.8820112 -1.145715 0.1185338 debye
dipolederiv: -0.6618069 0.1947361 -0.036119 0.3118299 -0.7778642 0.0833455 -0.1468441 0.1647725 -0.4313282 1.8521727 -0.2223693 -0.042627 -0.3023775 1.5677314 -0.1303566 0.0087863 -0.1610702 1.1262542 -1.083635 0.0109755 0.0381802 -0.0487664 -0.7517304 -0.0908391 0.1006945 -0.1204571 -0.7917155 -0.3922501 -0.0589577 -0.0150831 -0.0880019 -0.3932119 -0.0330174 -0.0285178 -0.0092975 -0.2889095 0.1727268 -0.0847753 -0.0980923 -0.1542368 0.2903744 0.0362223 -0.2888149 0.0699013 0.4546467 0.4822315 0.0757508 0.0929602 0.2606798 0.2893155 -0.0436394 0.2159463 -0.0382721 0.1660091 -0.2623259 -0.0216504 -0.0392904 0.0057711 -0.2527645 0.0129925 -0.0120342 0.0084229 -0.2912415 0.093576 0.0382873 -0.0239073 0.0725919 -0.1017462 0.0679039 -0.0303153 0.0356604 0.0990003 -0.0750836 0.0059062 0.0793814 -0.0031115 0.1185613 0.0043288 0.0660449 -0.0015189 0.0989475 0.1306721 0.00766 -0.0202571 -0.0025674 0.0983491 -0.0382333 -0.022194 -0.0274716 -0.0895688 -0.0207685 -0.1295729 -0.0871128 -0.0926897 0.0149198 -0.0590628 -0.0422424 -0.0527462 0.0434421 -0.131058 0.172619 0.0477055 0.1421638 -0.0062926 -0.0098474 -0.0065641 0.0125024 0.0312137 0.0427772 -0.0038762 0.0922489 -0.0595563 -0.0473684 0.1618404 0.1185148 0.0422535 -0.1279194 -0.1930848 0.0701262 -0.0724018 0.1263545 -0.0208715 0.0291104 -0.0266716 0.0103781 0.1009033 0.0834419 0.024248 0.0981385 -0.0078061 0.0651523 -0.0729146 0.0248517 -0.0839519 -0.0902566 -0.0375855 -0.0791074 -0.0137241 -0.1602777 -0.0925541 0.082167 0.06936 0.1508944 -0.0094774 unknown
polarizability: 81.6662452|-5.3209038|73.0238682|0.5611386|-0.8961831|61.3515842 unknown
InChI: InChI=1S/C3H10ClNSi/c1-5(2)6(3)4/h6H,1-3H3
charge 0 multiplicity 1
16 atoms
Cl -1.77619 1.859845 -0.236316
Si -0.76083 0.045818 0.649926
N  0.90334 -0.148884 0.125989
C  -1.858202 -1.403541 0.130383
C  1.269052 -0.759305 -1.166623
C  1.992244 0.647061 0.726894
H  -0.723229 0.339141 2.12036
H  -1.447867 -2.360616 0.4982
H  -2.870934 -1.271328 0.549027
H  -1.961749 -1.457554 -0.96697
H  0.451005 -1.395737 -1.545444
H  2.165542 -1.399239 -1.042016
H  1.49817 0.005883 -1.938856
H  2.887835 0.011644 0.878289
H  1.684245 1.042943 1.710582
H  2.283166 1.506366 0.085976
