program: Gaussian 09
title: 000117760
version: EM64L-G09RevD.01
frameworkgroup: C1[X(C7H8N2O5S)]
method: RPBEPBE
basis: SDD
operation: Freq
keyword: #p
keyword: freq=noraman
keyword: PBEPBE/SDD
title: #p freq=noraman PBEPBE/SDD
converged: YES YES NO NO
title: Mulliken charges:
elementType: S O O O O O N N C C C C C C C H H H H H H H H
charge: 0.987897 -0.569991 -0.504462 -0.508398 -0.428966 -0.312000 -0.411688 -0.563829 -0.098040 0.106700 0.302412 -0.282394 -0.198596 -0.330242 0.155261 0.317533 0.281489 0.295505 0.370761 0.379805 0.308889 0.308832 0.393521
chargesum: 0.00000
title: Mulliken charges with hydrogens summed into heavy atoms:
elementType: S O O O O O N N C C C C C C C
charge: 0.987897 -0.190186 -0.504462 -0.508398 -0.035445 -0.312000 -0.040927 0.053893 -0.098040 0.106700 0.302412 0.035140 0.082893 -0.034737 0.155261
polarizability: 2.04605434e+02 -3.87447477e+00 1.51567889e+02 6.20052725e-01 1.34238392e-01 7.54080885e+01
1716.lowfreq: -6.4038 -2.8903 -0.0016 -0.0013 -0.0008 6.7871 27.6812 63.0444 84.5128
frequency: 27.5105 63.0400 84.5123 101.1811 131.1390 146.4868 170.8557 189.2397 210.8977 221.1030 240.7229 281.6948 294.5844 306.5812 364.4527 368.9864 388.7866 391.3233 428.7020 436.9687 521.1344 557.7292 568.5571 584.7377 594.0928 615.5780 658.9657 696.2632 765.2936 771.0963 785.0894 820.9167 842.1749 860.0477 947.1826 966.6879 999.5773 1010.3901 1044.4844 1065.0997 1105.7447 1145.0406 1156.4136 1236.3313 1239.3557 1307.2060 1339.5447 1403.7539 1422.1947 1444.6214 1499.9870 1582.0982 1588.4781 1630.0563 1667.3680 3158.6227 3174.3044 3189.8759 3315.7632 3444.8412 3480.1030 3537.3204 3574.6173
redmass: 8.0183 6.1285 6.8169 8.4027 3.9874 4.9660 2.0567 4.9112 5.7850 3.7605 5.4108 1.2985 3.8007 4.3035 8.4516 7.1630 8.3109 8.1673 8.5450 3.3169 5.7549 3.3269 1.9212 1.4090 2.8950 6.3011 4.4010 5.9051 1.5386 5.5301 2.0891 8.2478 8.8618 1.4493 1.4474 16.5029 1.3257 4.9681 1.1782 2.0688 2.3098 2.0051 1.7179 1.4481 1.1737 1.9037 2.5239 7.0416 5.2753 2.5553 3.3196 6.0466 3.0066 4.3319 1.2141 1.0905 1.0928 1.0945 1.0812 1.0414 1.0661 1.0643 1.1038
irintensity: 1.9111 0.7575 3.2926 0.0711 2.9213 4.6636 35.2468 18.0517 7.2537 13.4026 6.2928 53.5569 68.8017 5.5199 11.9525 3.4576 6.8844 12.4456 80.1221 13.0122 88.5021 53.6973 146.1751 181.8792 37.4787 46.2715 63.1917 1.5218 42.8902 11.2099 97.9592 39.9490 55.3564 32.6648 9.2659 77.3786 3.2688 211.8172 72.9591 88.9564 76.3197 170.6188 7.5444 12.8815 0.1554 47.6824 61.5058 9.1372 9.9852 75.5930 103.3759 119.2132 16.7490 342.3444 87.4457 3.0140 10.7982 0.1537 131.3165 0.8428 38.4693 72.5619 7.9264
temp: 298.150 k
press: 1.00000 atm
elementType: 16 8 8 8 8 8 7 7 6 6 6 6 6 6 6 1 1 1 1 1 1 1 1
symmnumber: 1
zpe: 407732.3 jmol-1
zpe.correction: 0.155297 hartree
zpe.thermalcorrener: 0.170698 hartree
zpe.thermalcorrenthalpy: 0.171642 hartree
zpe.thermalcorrgfe: 0.112357 hartree
zpe.sumelectzpe: -1153.923899 hartree
zpe.sumelectthermal: -1153.908499 hartree
zpe.sumelectthermalent: -1153.907555 hartree
zpe.sumelectthermalfe: -1153.966840 hartree
dipole: 6.4907 -1.4763 1.4480
dipole: 6.8122
quadrupole: -87.4029 -84.9152 -97.0115
quadrupole: -7.9900 -9.1035 0.6005
quadrupole: 2.3736 4.8614 -7.2350 -7.9900 -9.1035 0.6005
hfenergy: -1154.0791964 hartree
pointgroup: C01 [X(C7H8N2O5S1)]
dipole: -2.5649231 0.6431902 0.43646 debye
dipolederiv: 2.3445411 -0.0802186 0.1268785 -0.230726 1.1805987 -0.0324073 0.3247245 -0.0492731 1.6661324 -0.5915209 -0.0192364 -0.2254395 0.0177775 -0.5446883 0.0454111 -0.3866049 0.0556865 -1.0205312 -0.724215 0.0668886 -0.0073057 0.1713926 -0.6016321 -0.1115486 -0.0145233 -0.0327793 -0.5147987 -0.7979394 -0.05824 0.0304639 -0.0943872 -0.5659577 0.1083386 -0.0152276 0.0303306 -0.5151308 -0.2746299 0.3435402 0.0107572 0.0562457 -1.3999431 -0.0214749 0.0044677 -0.004849 -0.4058845 -1.2058625 -0.1742743 -0.0371865 -0.1682244 -0.7139531 -0.0146031 -0.0301041 -0.0108629 -0.3518588 -0.9873494 0.2660596 -0.0206565 0.078359 -0.1016901 0.0073561 -0.0185731 0.0144524 -0.4312824 -0.492722 -0.1390979 -0.0175453 -0.312151 -0.2119771 -0.0128976 -0.0190939 -0.0067792 -0.0211457 -0.5254743 -0.1159073 -0.0048247 -0.07946 -0.5692624 -0.0122189 0.1844495 -0.0257702 -0.1925626 -0.7971101 -0.4898954 -0.0412268 -0.0059527 -0.6862427 -0.0127803 -0.0393252 -0.029335 -0.0629646 1.442289 -0.6053594 0.0363231 -0.0500969 0.1858001 -0.0008819 0.0373038 -0.0175189 0.1548743 0.4975047 0.3927882 0.0242793 0.3368196 0.040168 0.0149182 0.0037267 0.0247849 -0.0198564 0.1553901 -0.1837817 0.0018111 -0.3744799 0.3560329 -0.0071164 -0.0247081 -0.0080127 -0.0524772 -0.6509362 0.2028902 -0.0196973 -0.217599 0.1075833 -0.0020952 -0.035971 0.0167271 -0.1880881 1.4085937 0.3074419 0.0493798 0.4941235 1.9718677 0.0584698 0.0525621 0.0382881 0.2453372 0.165681 0.0416271 0.0086094 0.0259956 0.1125932 0.0014153 0.005685 -0.006573 0.1505439 0.0995682 -0.0763797 0.002925 -0.0370383 0.0896538 -0.005853 0.0052484 0.0029357 0.1463624 0.0970281 0.0228833 -0.0020567 0.0012074 0.0229983 -0.0016476 0.0075133 -0.0023276 0.1737141 0.243721 0.0824879 -0.0005164 0.093635 0.2618114 0.0032923 0.0013894 0.0004592 0.3382155 0.0869538 0.043573 0.0880331 0.0448142 0.3417625 -0.0137715 -0.0415132 0.0054776 0.2611977 0.1776754 0.13326 0.1009293 0.1256875 0.1614971 0.0529027 0.0472192 0.0265481 0.1253181 0.1907234 0.1351099 -0.0934987 0.1327113 0.1627866 -0.0433313 -0.0401034 -0.017632 0.1164014 0.1380902 -0.0961595 -0.0104356 -0.0086535 0.400193 0.0005236 -0.0085419 -0.0039773 0.3984839 unknown
polarizability: 204.007887|-5.4315022|151.8119764|6.5854288|0.9412945|75.7615484 unknown
InChI: InChI=1S/C7H8N2O5S/c8-9-6-2-1-4(15(12,13)14)3-5(6)7(10)11/h1-3,9-10,12H,8H2
charge 0 multiplicity 1
23 atoms
S  3.003571 -0.126322 -0.012554
O  3.174979 -0.19034 1.843446
O  3.312898 -1.601289 -0.602134
O  3.826204 1.163191 -0.545412
O  -1.445465 -2.963169 -0.183771
O  -3.314701 -1.59871 -0.215804
N  -2.919192 1.051823 -0.154416
N  -3.385787 2.382676 -0.145503
C  1.184955 0.222883 -0.043202
C  -1.094177 -0.590304 -0.128742
C  -1.566229 0.780655 -0.116594
C  0.299601 -0.852199 -0.085607
C  0.761113 1.572981 -0.030882
C  -0.607853 1.844616 -0.072567
C  -2.048278 -1.706226 -0.179033
H  0.656798 -1.885816 -0.10231
H  1.499501 2.380829 -0.006548
H  -0.990557 2.867286 -0.069098
H  -3.558939 0.239067 -0.188449
H  4.140938 -0.359256 2.047382
H  -3.897892 2.630681 0.706691
H  -3.850207 2.658816 -1.016155
H  -2.151778 -3.661972 -0.219932
