program: Gaussian 09
title: 000117890
version: EM64L-G09RevD.01
frameworkgroup: C1[X(C14H24O2)]
method: RPBEPBE
basis: SDD
operation: Freq
keyword: #pfreq=noraman
keyword: PBEPBE/SDD
title: #p freq=noraman PBEPBE/SDD
converged: YES YES NO NO
title: Mulliken charges:
elementType: O O C C C C C C C C C C C C C C H H H H H H H H H H H H H H H H H H H H H H H H
charge: -0.253115 -0.251178 -0.373756 -0.369882 -0.374680 -0.371213 -0.376024 -0.487936 -0.317728 -0.013383 -0.462592 -0.349962 -0.036565 0.283890 -0.682863 -0.753498 0.199541 0.188850 0.216961 0.187913 0.201339 0.190360 0.207643 0.197499 0.207018 0.230219 0.230289 0.224744 0.222353 0.232371 0.222600 0.229485 0.199883 0.208833 0.230716 0.215718 0.206373 0.248186 0.246990 0.244600
chargesum: 0.00000
title: Mulliken charges with hydrogens summed into heavy atoms:
elementType: O O C C C C C C C C C C C C C C
charge: -0.253115 -0.251178 0.014636 0.034992 0.017019 0.033928 0.061213 -0.032903 0.136996 -0.013383 -0.010507 0.058754 -0.036565 0.283890 -0.030056 -0.013722
polarizability: 1.82172706e+02 7.18998547e+00 1.66617800e+02 3.31956405e+00 -3.21441474e+00 1.23430986e+02
1716.lowfreq: -9.9331 -5.4051 -0.0009 -0.0008 -0.0007 2.3338 8.3198 13.1162 22.9920
frequency: -1.6495 12.7891 22.7398 31.4981 35.2030 50.0238 63.8147 68.8666 80.7648 99.9944 108.6010 125.7055 132.8155 167.0648 204.8779 219.2268 227.5566 247.1372 277.5555 315.6969 341.1577 355.1106 381.9793 418.0800 483.7314 484.8442 553.4592 568.8138 625.1260 672.1328 728.2599 748.4117 769.9958 788.6898 805.6069 842.5814 850.1271 875.9686 887.4401 940.3679 952.3134 992.6570 999.6437 1019.1613 1026.5234 1042.4778 1047.2941 1071.3953 1075.4284 1078.3613 1090.5982 1097.6625 1111.1032 1162.0262 1172.2716 1190.7784 1204.5727 1223.9113 1225.9921 1239.0687 1257.1600 1269.1388 1280.5255 1282.6833 1292.9603 1294.5575 1316.2454 1320.5749 1326.8701 1342.2564 1353.1856 1358.0215 1370.3496 1384.1164 1388.4718 1452.7413 1453.7260 1456.0917 1457.1406 1458.8685 1459.3754 1462.8994 1466.7853 1468.4761 1475.2328 1477.0317 1484.6967 1486.8684 1649.1610 2272.3737 2952.8043 2955.6654 2961.7039 2963.5979 2964.3421 2974.0865 2975.4552 2984.6242 2988.7266 2991.8721 3005.7727 3006.3991 3012.8788 3014.3275 3020.1171 3025.3821 3039.4400 3045.5465 3053.2737 3073.7515 3077.6591 3098.7364 3099.7808 3140.6572
redmass: 3.1576 3.9667 3.3077 1.4313 2.3181 3.0158 3.9044 1.9665 3.3590 2.3571 2.7157 1.9271 2.3487 1.9721 3.4360 3.8487 1.9193 1.8603 2.8305 2.7885 2.8326 3.8033 3.3296 3.3618 3.2241 3.4615 3.2860 3.2041 4.3781 2.1684 1.0792 1.1460 1.9085 1.5800 1.5891 1.7330 2.1983 1.4157 1.4989 4.8033 2.0104 1.4735 2.0652 3.7135 2.6637 1.6601 2.1876 2.1492 2.2267 2.2241 3.1680 1.7836 1.5850 2.4407 1.5994 1.2617 3.3305 1.2532 1.3764 1.2672 1.2494 1.2783 1.1799 1.0920 1.1144 1.1319 1.3061 1.3700 1.4093 1.4145 1.4813 1.6390 1.3360 1.2667 1.2263 1.0998 1.0517 1.0544 1.0849 1.0841 1.0763 1.0723 1.0803 1.0705 1.0453 1.0968 1.0704 1.0908 8.7515 11.6816 1.0589 1.0597 1.0592 1.0600 1.0591 1.0618 1.0355 1.0628 1.0657 1.0895 1.0989 1.0379 1.0991 1.0982 1.0576 1.1032 1.1010 1.1043 1.1038 1.1003 1.1002 1.0950 1.1084 1.1019
irintensity: 0.2086 0.6122 0.6011 0.6442 0.0928 0.2677 2.3979 0.1782 1.3132 1.6183 1.3902 0.0478 1.1458 0.7455 0.5692 1.7478 5.6798 6.1914 12.7862 5.8148 2.8855 0.1378 2.8874 0.4741 5.2741 2.9514 1.5410 3.7779 7.1634 0.7421 10.7492 1.4071 17.6863 5.1894 3.1719 1.7110 2.0659 2.3444 2.7259 41.2072 1.2471 1.7077 59.2783 15.0702 28.4555 9.5288 4.1239 5.0273 1.9195 2.4307 2.5796 0.6520 0.3848 0.0868 1.0139 34.1945 290.7457 2.1194 13.3985 4.0243 0.3966 6.5012 0.8731 0.9214 0.2168 1.7335 2.7827 6.7740 5.2084 7.0872 2.5733 3.2343 4.5094 49.9877 12.8077 24.0008 15.4469 15.5677 1.0333 13.8566 1.0243 1.1503 1.5150 6.0053 12.0200 0.4237 8.5996 22.2002 165.9725 0.5907 1.3328 1.0129 27.5422 69.3080 25.4658 77.3879 30.7626 38.7560 17.2784 12.8233 3.3847 2.7279 31.6518 29.6239 45.6613 9.6940 16.0178 55.4444 95.2479 62.9190 59.9832 9.8753 30.4464 9.5921
temp: 298.150 k
press: 1.00000 atm
elementType: 8 8 6 6 6 6 6 6 6 6 6 6 6 6 6 6 1 1 1 1 1 1 1 1 1 1 1 1 1 1 1 1 1 1 1 1 1 1 1 1
symmnumber: 1
zpe: 914438.9 jmol-1
zpe.correction: 0.348291 hartree
zpe.thermalcorrener: 0.368199 hartree
zpe.thermalcorrenthalpy: 0.369143 hartree
zpe.thermalcorrgfe: 0.295000 hartree
zpe.sumelectzpe: -697.002723 hartree
zpe.sumelectthermal: -696.982816 hartree
zpe.sumelectthermalent: -696.981871 hartree
zpe.sumelectthermalfe: -697.056014 hartree
dipole: -0.1456 -1.5298 0.6607
dipole: 1.6728
quadrupole: -92.9885 -97.6854 -98.9080
quadrupole: 8.3959 -0.5602 2.3047
quadrupole: 3.5388 -1.1581 -2.3807 8.3959 -0.5602 2.3047
hfenergy: -697.3510146 hartree
pointgroup: C01 [X(C14H24O2)]
dipole: -0.0558848 -0.5907357 0.2846608 debye
polarizability: 181.6225509|7.78605|166.5262986|5.0299079|-4.7992333|124.0726424 unknown
InChI: InChI=1S/C14H24O2/c1-3-4-5-6-7-8-9-10-11-12-13-16-14(2)15/h3-4,7-13H2,1-2H3
charge 0 multiplicity 1
40 atoms
O  -4.925184 -0.140655 0.311882
O  -4.575288 1.630663 -1.169848
C  -0.096114 -1.564283 -0.296916
C  1.348042 -1.475028 0.243855
C  -1.103032 -0.729242 0.526295
C  2.35279 -2.304408 -0.583969
C  -2.543394 -0.811478 -0.031244
C  3.81513 -2.210153 -0.058884
C  -3.524958 0.009515 0.814918
C  4.376556 -0.845192 -0.117025
C  5.386106 1.669587 -0.248969
C  4.303156 2.752287 -0.53263
C  4.842954 0.29823 -0.174031
C  -5.318446 0.735157 -0.70669
C  3.242674 2.855375 0.582762
C  -6.731755 0.424625 -1.151437
H  -0.114196 -1.220941 -1.352057
H  -0.422763 -2.625382 -0.308206
H  1.675962 -0.41602 0.25209
H  1.369744 -1.818499 1.299594
H  -0.770927 0.3295 0.540329
H  -1.09005 -1.077031 1.580516
H  2.327319 -1.969831 -1.639683
H  2.049773 -3.37131 -0.576195
H  -2.876692 -1.867422 -0.053674
H  -2.56063 -0.435414 -1.071785
H  4.457975 -2.894006 -0.648697
H  3.846846 -2.576895 0.987713
H  -3.578626 -0.359892 1.852623
H  -3.258102 1.081964 0.803211
H  5.897812 1.914645 0.704334
H  6.160779 1.713905 -1.040616
H  4.815175 3.727181 -0.655271
H  3.811482 2.522328 -1.497145
H  2.720003 1.890381 0.714843
H  2.487344 3.62647 0.344955
H  3.708467 3.121613 1.550518
H  -7.368495 0.179584 -0.286409
H  -6.722892 -0.455273 -1.820277
H  -7.14425 1.282646 -1.702381
