program: Gaussian 09
title: 000117804
version: EM64L-G09RevD.01
frameworkgroup: C1[X(C11H16O4)]
method: RPBEPBE
basis: SDD
operation: Freq
keyword: #pfreq=noraman
keyword: PBEPBE/SDD
title: #p freq=noraman PBEPBE/SDD
converged: YES YES NO NO
title: Mulliken charges:
elementType: O O O O C C C C C C C C C C C H H H H H H H H H H H H H H H H
charge: -0.456542 -0.294534 -0.437871 -0.283932 -0.556921 -0.159802 0.509342 -0.330456 -0.539337 -0.433052 0.219182 0.213046 -0.344901 -0.522094 -0.535824 0.233168 0.230701 0.219531 0.239051 0.190598 0.258763 0.263454 0.238687 0.345268 0.348257 0.210115 0.257821 0.227810 0.242796 0.221009 0.226667
chargesum: 0.00000
title: Mulliken charges with hydrogens summed into heavy atoms:
elementType: O O O O C C C C C C C C C C C
charge: -0.111274 -0.294534 -0.089613 -0.283932 -0.093052 0.059729 0.509342 0.099194 -0.280574 -0.169598 0.219182 0.213046 -0.106214 0.173652 0.154649
polarizability: 1.83832957e+02 -4.73101078e+00 1.36448785e+02 -1.03263946e+01 -4.89972545e+00 8.85880906e+01
1716.lowfreq: -14.2365 -0.0009 -0.0005 -0.0005 5.1066 6.4307 28.6725 36.0944 53.5229
frequency: 27.9384 36.0301 53.4285 66.8656 101.5598 120.5080 133.1469 163.1461 193.3204 212.2006 220.9639 247.8228 274.9732 285.6648 311.4771 322.5235 346.1824 376.3748 412.6349 454.1927 483.2457 518.2854 538.7526 587.0368 628.7971 640.7330 712.1266 728.9015 739.2562 794.9289 816.6950 874.8123 896.1574 899.8842 933.1547 942.3781 981.4705 986.9640 996.7982 1035.6832 1060.8528 1111.0732 1111.4793 1112.0594 1143.7010 1151.2738 1158.1183 1168.8436 1173.7434 1207.0200 1218.5286 1254.4866 1271.5829 1295.6408 1310.4164 1335.3786 1375.1010 1379.2174 1384.0424 1404.4075 1431.9827 1441.3696 1455.8542 1465.2051 1467.0708 1468.9188 1473.8336 1481.8347 1496.6363 1580.3413 1615.7694 2930.4956 2960.8213 2972.5126 2980.5842 3012.7293 3049.8014 3074.3509 3079.3742 3080.4071 3123.1464 3124.4326 3131.9187 3141.8206 3160.3588 3496.6421 3556.4594
redmass: 4.4761 5.5106 3.7616 2.1547 4.2847 4.8416 1.6874 2.0165 3.3582 3.0509 3.5900 1.3408 3.5260 2.7870 1.2937 3.3756 3.2195 2.9136 3.1131 4.2686 3.6726 2.0341 1.6487 4.4646 3.7650 4.0665 5.4768 3.7290 4.5761 2.2383 1.7176 3.0239 2.2847 2.1703 2.0178 1.5678 3.6318 4.9166 3.4675 1.7781 2.0758 1.7885 1.3797 1.3765 1.4724 1.1736 1.3319 1.1642 1.4868 1.8386 1.3961 2.6928 1.6059 1.3270 1.5212 1.3981 2.0305 2.2623 1.4664 2.0880 1.2377 1.3818 1.0744 1.0508 1.0979 1.0851 1.1047 1.0533 2.5710 7.3040 6.6912 1.0711 1.0326 1.0348 1.0858 1.0595 1.1040 1.1026 1.0914 1.0969 1.0996 1.1044 1.0892 1.0915 1.0945 1.0647 1.0662
irintensity: 3.1139 3.1753 5.5303 4.5464 4.5654 9.6993 2.9570 4.8743 5.3654 9.2547 2.9019 0.1482 3.9853 7.4688 81.1888 2.4188 7.1952 3.0313 11.4050 8.1120 0.7838 73.7724 155.9849 4.7807 26.0027 7.1741 16.2309 3.1935 4.1765 11.4111 36.9229 38.3542 16.1917 29.6182 19.7608 10.7328 40.4933 54.2412 51.0354 38.9918 18.8870 58.4455 25.2508 11.0448 24.4226 29.7617 36.4528 14.6794 8.0142 63.1702 11.5240 156.1636 40.4949 10.6354 11.7643 5.9777 2.3935 32.8637 19.7447 11.0536 0.3081 23.7975 13.5392 13.5704 11.6115 14.0944 70.7301 20.7854 123.6864 21.4155 10.4885 85.4914 67.2735 87.7830 48.6290 21.6438 45.7414 12.5560 25.9697 37.7019 24.2701 19.6984 3.2196 7.5112 9.9878 11.8840 3.1361
temp: 298.150 k
press: 1.00000 atm
elementType: 8 8 8 8 6 6 6 6 6 6 6 6 6 6 6 1 1 1 1 1 1 1 1 1 1 1 1 1 1 1 1
symmnumber: 1
zpe: 663799.8 jmol-1
zpe.correction: 0.252828 hartree
zpe.thermalcorrener: 0.269178 hartree
zpe.thermalcorrenthalpy: 0.270122 hartree
zpe.thermalcorrgfe: 0.207928 hartree
zpe.sumelectzpe: -728.447028 hartree
zpe.sumelectthermal: -728.430678 hartree
zpe.sumelectthermalent: -728.429734 hartree
zpe.sumelectthermalfe: -728.491928 hartree
dipole: -1.3195 0.3780 0.7341
dipole: 1.5566
quadrupole: -75.1982 -86.5934 -90.2869
quadrupole: -13.1633 10.5303 -0.6012
quadrupole: 8.8280 -2.5672 -6.2608 -13.1633 10.5303 -0.6012
hfenergy: -728.699856 hartree
pointgroup: C01 [X(C11H16O4)]
dipole: -0.5220856 0.1202836 0.2966508 debye
polarizability: 183.8645822|-2.1107908|135.9777097|-11.5867912|-5.8000766|89.0275409 unknown
InChI: InChI=1S/C11H16O4/c1-14-10-4-3-8(5-9(13)7-12)6-11(10)15-2/h3-4,6,9,12-13H,5,7H2,1-2H3
charge 0 multiplicity 1
31 atoms
O  4.536019 -0.874855 -0.136855
O  -2.204985 -1.95887 0.567035
O  3.905871 1.887756 -0.108749
O  -3.226902 0.686992 0.29552
C  2.289649 -0.541165 -0.939436
C  3.183446 -0.438668 0.316234
C  0.834927 -0.200061 -0.658055
C  3.312364 0.989132 0.884371
C  -0.073843 -1.197308 -0.224551
C  0.35362 1.122342 -0.807042
C  -1.420737 -0.901038 0.07119
C  -1.886303 0.444551 -0.060639
C  -0.99123 1.442219 -0.513568
C  -3.512912 -2.204789 -0.074732
C  -3.695854 2.073692 0.247383
H  2.385569 -1.572791 -1.323187
H  2.704708 0.138863 -1.70516
H  2.801478 -1.120919 1.10501
H  2.32455 1.40934 1.132728
H  3.929265 0.964742 1.811148
H  0.244931 -2.239832 -0.111789
H  1.036587 1.907828 -1.151118
H  -1.331431 2.475548 -0.631642
H  5.092454 -1.087782 0.655595
H  4.658717 1.38247 -0.519327
H  -3.378845 -2.411901 -1.154538
H  -4.189814 -1.346181 0.063073
H  -3.910353 -3.099052 0.429422
H  -4.737405 2.03594 0.599369
H  -3.66495 2.476611 -0.78374
H  -3.098091 2.721387 0.917349
