program: Gaussian 09
title: 000016344
version: EM64L-G09RevD.01
frameworkgroup: C1[X(C23H32Cl2N2)]
method: RPBEPBE
basis: SDD
operation: Freq
keyword: #p
keyword: freq=noraman
keyword: PBEPBE/SDD
title: #p freq=noraman PBEPBE/SDD
converged: YES YES NO NO
title: Mulliken charges:
elementType: Cl Cl N N C C C C C C C C C C C C C C C C C C C C C C C H H H H H H H H H H H H H H H H H H H H H H H H H H H H H H H H
charge: -0.059772 -0.076717 -0.274403 -0.292720 -0.386515 -0.380375 -0.370190 -0.370575 -0.359145 -0.398488 -0.425338 -0.363806 -0.370950 -0.488978 -0.481760 0.551830 0.539314 -0.302526 -0.308557 -0.397564 -0.373072 -0.229070 -0.231830 -0.236865 -0.236531 -0.226288 -0.223665 0.189871 0.196757 0.188983 0.196920 0.183887 0.191702 0.192781 0.186885 0.180930 0.226783 0.178324 0.222838 0.193377 0.199455 0.173937 0.211865 0.194290 0.200078 0.248166 0.256566 0.228699 0.188958 0.204838 0.216007 0.236495 0.244085 0.254289 0.255642 0.230654 0.231864 0.233712 0.234915
chargesum: 0.00000
title: Mulliken charges with hydrogens summed into heavy atoms:
elementType: Cl Cl N N C C C C C C C C C C C C C C C C C C C C C C C
charge: -0.059772 -0.076717 -0.026237 -0.036154 0.000113 0.005529 0.005399 0.009091 0.048568 0.002675 -0.032507 0.021995 0.023419 -0.071320 -0.060915 0.551830 0.539314 -0.302526 -0.308557 -0.161068 -0.128987 0.025220 0.023812 -0.006211 -0.004667 0.007425 0.011250
polarizability: 3.28815618e+02 3.49078629e+01 2.71546009e+02 3.38919328e+00 6.58155788e-01 2.37735105e+02
1716.lowfreq: -10.1537 -6.0090 -3.8049 -1.9558 -0.0024 -0.0014 -0.0013 5.4872 7.5478
frequency: -9.1926 -2.2351 6.6638 13.7815 16.9502 28.0444 32.7685 46.2085 61.9154 65.0993 77.9113 92.1395 102.8239 110.9402 113.7486 130.7005 136.6025 142.2729 153.1768 161.9142 185.3163 200.2095 227.7353 241.4850 247.2853 260.6597 282.0901 304.5992 344.3809 364.6864 369.3762 384.7230 419.0757 424.1969 436.1352 450.1450 459.8228 479.6562 502.3145 534.8243 547.5191 596.1370 601.2775 643.3270 655.3298 664.3584 676.5381 720.4921 725.0471 727.8910 729.5897 749.6856 759.2459 760.2328 786.0589 819.6614 824.2135 841.7737 864.9211 868.0918 881.1942 909.6062 944.7086 946.1260 952.5088 957.2797 978.3542 983.3160 985.0616 986.0454 1000.7239 1014.2019 1016.3630 1022.3182 1027.4797 1037.1775 1038.5655 1045.9792 1058.9168 1071.9953 1079.8332 1083.2877 1106.4539 1117.7485 1119.4025 1129.5700 1137.6876 1145.8305 1151.0375 1171.7293 1172.1024 1185.4870 1201.8858 1208.0240 1213.8958 1214.8641 1227.7585 1238.6950 1245.9537 1261.4037 1271.6990 1276.7677 1278.4607 1281.3487 1283.5350 1289.3125 1291.1021 1292.9262 1315.9756 1326.1314 1336.9300 1352.0156 1355.0009 1359.6305 1376.7576 1378.0250 1382.3678 1387.2251 1423.8781 1424.6320 1442.6006 1448.0033 1460.3950 1461.2431 1463.8447 1464.0839 1465.3717 1465.8557 1471.4609 1480.1822 1481.7917 1484.8441 1488.0272 1491.6838 1494.7060 1575.4230 1576.9463 1605.7420 1606.7861 2834.4203 2854.4619 2856.5421 2890.8941 2946.2441 2950.0795 2951.4526 2953.9580 2955.4384 2961.6971 2966.0595 2983.3137 2987.9904 2991.0512 2992.1469 3005.3167 3005.9213 3011.1408 3016.0527 3027.8304 3043.7850 3048.6408 3122.7457 3132.4341 3139.4896 3144.0483 3157.8342 3160.5488 3173.3470 3175.0036 3415.0316 3439.5032
redmass: 8.7770 5.9409 7.3784 5.5861 5.3016 5.4696 3.9847 1.8891 4.2688 3.4319 2.5921 2.2151 2.6470 3.3696 3.8351 2.2127 2.5370 3.5050 2.4993 3.5436 2.8343 4.3284 3.6324 3.5618 4.1216 4.0550 3.7323 4.4277 3.9928 4.2704 3.8756 3.5443 4.0638 4.2925 3.3798 3.3992 3.6336 3.2488 3.5417 3.6312 2.9188 4.9137 4.3895 1.3791 3.2105 5.9553 1.8870 1.0656 3.2525 3.8479 1.0966 1.1317 1.2485 1.2478 1.2178 3.7900 3.6466 1.2980 1.4065 1.4327 1.8178 1.3854 1.3948 1.4025 1.7442 1.6283 1.4609 1.3904 1.5528 2.4048 3.6689 3.8204 3.2015 2.7815 2.2228 2.2059 2.1617 2.6503 2.9822 2.5883 2.0689 2.3241 3.2389 1.5949 1.6996 3.4061 4.1242 1.3763 1.3659 1.0763 1.0652 1.3620 1.4427 1.3582 2.1962 2.2376 1.4205 1.3103 1.3481 1.2727 1.2342 1.0528 1.3160 1.2611 1.1731 1.2103 1.1321 1.1404 1.3057 1.2880 1.3875 1.5191 1.7139 1.6335 6.9417 7.9745 1.4484 1.4764 2.1492 2.1854 1.1405 1.1920 1.0755 1.0738 2.5368 2.5244 1.0817 1.0927 1.0936 1.1005 1.1046 1.1098 1.0995 1.0837 1.0869 6.1833 6.1158 7.2502 7.2418 1.0715 1.0717 1.0708 1.0698 1.0589 1.0589 1.0600 1.0634 1.0635 1.0621 1.0642 1.0949 1.0873 1.0972 1.0837 1.0896 1.0975 1.0989 1.0860 1.1029 1.1020 1.1023 1.0876 1.0861 1.0890 1.0905 1.0949 1.0954 1.0995 1.0996 1.0744 1.0746
irintensity: 0.7881 0.3538 0.4080 0.0738 0.3896 0.1897 0.5676 0.2145 0.3242 0.9729 1.1655 0.4300 1.8554 0.3739 0.1267 0.5686 0.5839 0.2550 0.9133 0.6424 2.1987 0.0887 0.5732 3.3163 1.7763 0.1371 0.9080 1.7369 1.2039 0.7444 4.9946 0.0460 2.6201 7.3438 0.4392 7.9566 6.9496 1.7387 0.9170 5.9733 0.4516 3.1158 12.8172 90.0438 22.1075 16.1404 91.8566 13.2099 15.8253 5.2593 1.4442 4.9209 83.9588 76.3468 1.3833 1.4342 2.9635 1.2863 0.2349 0.5804 0.7058 0.2037 2.3782 1.4173 13.8019 3.8928 1.4061 0.0420 0.3662 0.5496 1.1600 23.3610 23.0038 35.6584 26.4171 1.1446 7.3039 5.0624 1.0910 6.3160 0.1241 2.1268 8.4166 11.4269 7.6041 45.9746 62.0016 9.8644 12.4419 0.4264 0.2913 21.1528 5.8516 11.0669 1.5804 3.5634 4.1872 3.0529 1.4647 3.4866 1.3304 1.2716 0.6941 0.0675 0.6796 0.4284 0.0410 3.5375 9.3236 14.2489 14.6963 2.8200 0.2471 5.5190 2.2319 0.4659 0.3925 0.5920 21.7889 22.2131 42.1522 36.4169 0.6234 0.0705 26.2232 31.7250 1.6387 3.4434 1.7616 2.9302 2.9991 3.0549 18.3771 6.9024 9.4516 9.8331 10.0736 2.2005 2.6954 96.9823 142.6538 104.2309 91.2643 3.7685 1.1303 1.9413 14.5880 2.0425 48.2304 145.0954 4.8228 38.1715 5.9087 40.5806 17.9886 22.1352 24.4438 14.9631 6.5401 25.1417 227.2621 6.5283 1.0750 10.0390 12.0348 18.9022 16.3855 14.5709 12.5951 0.2660 0.4007
temp: 298.150 k
press: 1.00000 atm
elementType: 17 17 7 7 6 6 6 6 6 6 6 6 6 6 6 6 6 6 6 6 6 6 6 6 6 6 6 1 1 1 1 1 1 1 1 1 1 1 1 1 1 1 1 1 1 1 1 1 1 1 1 1 1 1 1 1 1 1 1
symmnumber: 1
zpe: 1309022.5 jmol-1
zpe.correction: 0.498580 hartree
zpe.thermalcorrener: 0.526293 hartree
zpe.thermalcorrenthalpy: 0.527237 hartree
zpe.thermalcorrgfe: 0.433881 hartree
zpe.sumelectzpe: -1923.192107 hartree
zpe.sumelectthermal: -1923.164394 hartree
zpe.sumelectthermalent: -1923.163450 hartree
zpe.sumelectthermalfe: -1923.256806 hartree
dipole: -0.6061 -1.5042 -2.1135
dipole: 2.6640
quadrupole: -166.5861 -168.0606 -174.4187
quadrupole: 24.9770 -2.8510 0.7352
quadrupole: 3.1024 1.6279 -4.7302 24.9770 -2.8510 0.7352
hfenergy: -1923.6906873 hartree
pointgroup: C01 [X(C23H32Cl2N2)]
dipole: 0.2384162 0.488022 -0.896381 debye
polarizability: 330.3938094|32.6177504|269.1517091|-8.7859944|-4.7046411|238.5512136 unknown
InChI: InChI=1S/C23H32Cl2N2/c24-22-14-8-6-12-20(22)18-26-16-10-4-2-1-3-5-11-17-27-19-21-13-7-9-15-23(21)25/h6-9,12-15,26-27H,1-5,10-11,16-19H2
charge 0 multiplicity 1
59 atoms
Cl 7.412821 -2.59343 1.298298
Cl -9.038824 0.44625 2.155618
N  5.756709 0.023633 -0.438992
N  -6.022727 1.196526 0.078031
C  -0.555654 1.164917 -0.476677
C  0.873119 1.256038 0.105078
C  -1.604846 1.938192 0.353777
C  1.922643 0.48495 -0.726636
C  -3.025527 1.878397 -0.249777
C  3.355292 0.612237 -0.162502
C  -4.065817 2.669261 0.573839
C  4.39994 -0.153584 -0.9967
C  -5.499622 2.582444 0.011589
C  6.82952 -0.684606 -1.17095
C  -7.389518 1.051038 -0.486579
C  8.161543 -0.524209 -0.458295
C  -7.907715 -0.364243 -0.299232
C  8.531086 -1.289085 0.67401
C  -8.65681 -0.769845 0.830143
C  9.093339 0.448887 -0.905513
C  -7.626551 -1.364632 -1.26712
C  9.753371 -1.105331 1.349437
C  -9.127593 -2.085401 1.009877
C  10.324759 0.659451 -0.246127
C  -8.082991 -2.691582 -1.118025
C  10.654317 -0.119066 0.885985
C  -8.838498 -3.052805 0.021633
H  -0.552449 1.555523 -1.516097
H  -0.857685 0.099084 -0.546927
H  1.172036 2.323481 0.171659
H  0.872569 0.868602 1.145173
H  -1.286687 2.998609 0.446351
H  -1.626494 1.530278 1.386366
H  1.638391 -0.587188 -0.771054
H  1.902744 0.856084 -1.773004
H  -3.001432 2.282598 -1.283889
H  -3.361695 0.827275 -0.335457
H  3.63489 1.687275 -0.122599
H  3.391724 0.238005 0.87879
H  -4.063678 2.304643 1.62353
H  -3.771288 3.737738 0.618115
H  4.324811 0.172008 -2.067574
H  4.1636 -1.236712 -0.979313
H  -6.156666 3.308974 0.554013
H  -5.496035 2.892313 -1.053599
H  5.988917 1.014415 -0.284449
H  -5.987197 0.834615 1.04327
H  6.550797 -1.754872 -1.212251
H  6.943699 -0.336236 -2.228885
H  -8.113497 1.774299 -0.039622
H  -7.331558 1.276701 -1.568875
H  8.837978 1.044761 -1.790514
H  -7.031739 -1.08134 -2.142831
H  9.996786 -1.723873 2.218187
H  -9.705118 -2.346145 1.901353
H  11.021821 1.419489 -0.614537
H  -7.851844 -3.439344 -1.883911
H  11.60611 0.030186 1.406943
H  -9.200977 -4.078545 0.147745
