program: Gaussian 09
title: 000117191
version: EM64L-G09RevD.01
frameworkgroup: C1[X(C10H20N2O4)]
method: RPBEPBE
basis: SDD
operation: Freq
keyword: #p
keyword: freq=noraman
keyword: PBEPBE/SDD
title: #p freq=noraman PBEPBE/SDD
converged: YES YES NO NO
title: Mulliken charges:
elementType: O O O O N N C C C C C C C C C C H H H H H H H H H H H H H H H H H H H H
charge: -0.315759 -0.302881 -0.296081 -0.285262 -0.369637 -0.617329 0.348161 -0.396441 -0.370752 -0.371428 -0.723358 -0.755563 0.309984 0.301234 -0.346015 -0.646986 0.205066 0.203682 0.258508 0.208876 0.211652 0.258629 0.198344 0.229278 0.228473 0.251667 0.207546 0.253026 0.317743 0.216342 0.254798 0.205157 0.234253 0.218838 0.335699 0.340536
chargesum: 0.00000
title: Mulliken charges with hydrogens summed into heavy atoms:
elementType: O O O O N N C C C C C C C C C C
charge: -0.315759 -0.302881 -0.296081 -0.285262 -0.051895 0.058906 0.348161 0.012307 0.096632 0.098853 -0.067263 -0.043324 0.309984 0.301234 0.125126 0.011262
polarizability: 1.79264282e+02 2.08714640e-01 1.25781716e+02 -1.65856321e-01 4.03737681e+00 1.08859821e+02
1716.lowfreq: -2.3140 -0.0003 -0.0001 0.0003 6.2761 9.4313 14.9264 28.8063 31.7736
frequency: 14.6500 28.3437 31.6211 35.4977 60.7589 61.8824 93.1114 96.9460 119.8409 156.6717 178.3190 209.2488 217.7808 235.8906 248.6645 253.6757 280.2805 287.6747 310.5013 346.1254 379.3484 394.1888 458.2175 469.7014 491.6864 520.0013 532.1850 560.6638 573.4700 613.9429 647.9393 692.2276 698.3808 724.9214 776.3894 786.5980 801.1037 872.9907 892.0130 894.6493 918.2717 958.8416 962.2283 995.7294 1010.0525 1023.4206 1057.0770 1064.0130 1070.1930 1080.2103 1123.2551 1145.6519 1176.4210 1188.6399 1200.3222 1229.8447 1241.3406 1280.5548 1286.7670 1298.9686 1305.0733 1343.6114 1354.3817 1364.3635 1368.1314 1385.3018 1389.4506 1405.6767 1461.2096 1464.5592 1469.2418 1471.2177 1472.9016 1479.5852 1482.0768 1483.0483 1495.9591 1498.5415 1501.4871 1586.7072 1671.3956 1686.8737 2979.3105 2980.9736 2982.6172 2983.8045 2993.0223 2995.1441 3003.3083 3031.3023 3065.9020 3067.4198 3068.2865 3073.1439 3075.4978 3085.7119 3086.1124 3098.0436 3098.0987 3559.3522 3565.0038 3718.0131
redmass: 2.9702 4.5465 4.8141 4.3243 4.5824 4.8416 4.1262 3.8033 2.1724 4.9764 1.7351 1.0529 1.6728 5.3653 2.5294 2.6193 1.5590 2.5453 2.7368 2.3358 2.7136 2.4861 2.9015 2.3564 1.1799 1.0655 3.3671 2.4106 1.3428 5.4961 4.1725 12.1887 11.1905 2.8941 1.3149 1.3395 4.0235 2.3986 2.4509 2.6499 1.9194 1.5631 1.8322 3.4815 1.6523 4.3130 1.9520 2.7984 1.5462 2.4939 2.8383 1.8559 2.1154 2.0756 2.3064 3.0569 1.1112 1.2358 1.1499 1.6291 2.0037 1.5773 1.2965 1.3137 1.4308 1.2590 1.2198 1.1960 1.0844 1.0698 1.0685 1.0638 1.0625 1.0573 1.0727 1.1174 1.1778 1.4102 1.0510 1.2100 8.8207 7.2060 1.0410 1.0431 1.0360 1.0497 1.0665 1.0578 1.0577 1.1007 1.1054 1.0979 1.1010 1.0983 1.1012 1.0972 1.1011 1.1013 1.1007 1.0445 1.0770 1.1058
irintensity: 0.2448 1.0595 0.9012 1.5133 0.4422 7.9876 7.9752 4.9051 0.1561 4.4616 1.6189 0.1433 2.8038 0.7478 9.5827 8.4191 1.3189 4.0231 12.5636 11.4142 1.9289 6.0361 1.6777 2.0586 294.5167 26.0762 10.5933 25.0249 98.9853 3.8374 6.5741 19.9260 34.7125 5.4249 12.0693 34.3118 35.1849 10.0758 3.7377 2.8488 22.2869 1.0374 41.3833 339.7870 5.3733 71.5789 19.0083 0.1698 6.1021 41.6667 114.6748 7.1891 0.1452 0.0543 278.6982 4.5212 4.1645 56.8060 53.5564 80.3625 240.5242 5.1992 1.9762 3.7574 63.3954 35.7991 17.7305 25.9543 4.8363 4.3336 46.6823 4.3357 4.5376 12.1064 21.0054 59.1811 101.6923 169.9942 1.6928 101.6315 216.9813 377.5840 12.1273 52.7531 30.5612 23.2627 54.7902 5.9661 62.4767 28.1022 9.9514 11.9907 21.9853 35.4783 26.2876 33.1424 15.7925 46.9110 21.3404 65.9648 28.2663 50.2918
temp: 298.150 k
press: 1.00000 atm
elementType: 8 8 8 8 7 7 6 6 6 6 6 6 6 6 6 6 1 1 1 1 1 1 1 1 1 1 1 1 1 1 1 1 1 1 1 1
symmnumber: 1
zpe: 795581.1 jmol-1
zpe.correction: 0.303021 hartree
zpe.thermalcorrener: 0.322469 hartree
zpe.thermalcorrenthalpy: 0.323413 hartree
zpe.thermalcorrgfe: 0.252382 hartree
zpe.sumelectzpe: -802.200732 hartree
zpe.sumelectthermal: -802.181284 hartree
zpe.sumelectthermalent: -802.180340 hartree
zpe.sumelectthermalfe: -802.251371 hartree
dipole: -0.3528 3.7115 2.7153
dipole: 4.6122
quadrupole: -68.1355 -104.2456 -95.4248
quadrupole: 3.2803 2.7601 -3.9733
quadrupole: 21.1331 -14.9769 -6.1562 3.2803 2.7601 -3.9733
hfenergy: -802.5037531 hartree
pointgroup: C01 [X(C10H20N2O4)]
dipole: -0.2029716 0.6965219 -1.6632505 debye
polarizability: 179.0229748|4.0250324|108.1742428|-0.8795577|0.0878417|126.7086006 unknown
InChI: InChI=1S/C10H20N2O4/c1-4-10(3,6-15-8(11)13)7-16-9(14)12-5-2/h12H,4-7,11H2,1-3H3
charge 0 multiplicity 1
36 atoms
O  -1.584837 -0.440968 -0.672023
O  3.361807 -0.021553 -0.596999
O  -2.414507 -0.626476 1.541307
O  4.088636 0.073147 1.655538
N  -3.68326 0.288611 -0.215671
N  5.284862 1.072664 -0.09786
C  0.87259 -0.066243 -0.622953
C  0.736684 1.299854 0.118158
C  -0.288565 -1.027934 -0.257514
C  2.168095 -0.810959 -0.206804
C  0.88148 0.182335 -2.154278
C  0.678047 1.25231 1.662958
C  -2.563865 -0.286756 0.338395
C  4.239557 0.354242 0.440616
C  -4.907856 0.539081 0.560032
C  -6.082364 -0.366195 0.133009
H  -0.176061 1.794756 -0.267531
H  1.589404 1.933351 -0.197032
H  -0.33144 -1.240095 0.825902
H  -0.194023 -1.978266 -0.816151
H  2.256523 -1.770013 -0.750482
H  2.213026 -0.996842 0.88136
H  0.982427 -0.767149 -2.714652
H  -0.060106 0.664661 -2.468503
H  1.72691 0.834599 -2.433058
H  1.594792 0.816354 2.098453
H  0.584322 2.27902 2.063148
H  -0.193557 0.6792 2.026598
H  -3.660237 0.488251 -1.216575
H  -5.191319 1.60489 0.45888
H  -4.650855 0.360717 1.617739
H  -6.347733 -0.211107 -0.929371
H  -5.824595 -1.430158 0.274022
H  -6.977374 -0.141393 0.741605
H  5.3310 1.244271 -1.099111
H  6.011391 1.414494 0.524149
