program: Gaussian 09
title: 000117085
version: EM64L-G09RevD.01
frameworkgroup: C1[X(C6H9ClN2)]
method: RPBEPBE
basis: SDD
operation: Freq
keyword: #p
keyword: freq=noraman
keyword: PBEPBE/SDD
title: #p freq=noraman PBEPBE/SDD
converged: NO YES NO NO
title: Mulliken charges:
elementType: Cl N N C C C C C C H H H H H H H H H
charge: -0.048343 -0.164344 -0.116801 -0.345134 0.240131 -0.202375 -0.569168 -0.756262 -0.330502 0.251326 0.248645 0.257053 0.280797 0.275782 0.272276 0.232269 0.222280 0.252371
chargesum: 0.00000
title: Mulliken charges with hydrogens summed into heavy atoms:
elementType: Cl N N C C C C C C
charge: -0.048343 -0.164344 -0.116801 0.154837 0.240131 0.054677 -0.012589 -0.029437 -0.078131
polarizability: 1.11973840e+02 4.35547340e+00 8.40432440e+01 9.63541059e+00 -1.14422790e-01 5.27078111e+01
1716.lowfreq: -0.0006 0.0023 0.0030 8.3134 9.5100 15.1319 53.8237 80.4348 88.9789
frequency: 53.8143 80.4258 88.9703 132.4541 226.3498 230.3196 277.1436 333.1461 415.3066 621.8773 638.3696 663.0936 690.7138 733.5643 757.2498 786.2689 844.1084 894.0288 965.6098 998.6235 1043.1366 1045.4707 1059.0677 1101.4794 1140.1636 1200.9378 1255.4736 1261.5598 1273.6315 1350.8285 1355.5268 1392.6580 1397.5947 1456.3662 1461.2852 1471.3404 1472.6075 1491.8902 1507.5737 2975.3563 3035.8306 3046.8898 3066.5458 3096.6767 3120.5319 3153.6085 3219.8839 3248.5645
redmass: 4.0880 2.4094 4.7315 1.0901 5.9124 3.2707 2.6686 4.8596 2.7028 3.6366 5.4977 4.9763 4.4362 1.3139 3.5971 1.1831 1.3679 5.6819 1.6726 1.5687 2.4163 1.7991 1.6863 1.4408 2.0553 2.5808 1.6230 1.3203 1.6548 1.9251 1.6041 2.3912 1.3060 1.1298 1.3383 1.2894 1.3120 1.5147 4.5045 1.0397 1.0604 1.0978 1.0563 1.1055 1.0956 1.1123 1.0908 1.1090
irintensity: 2.9269 2.1935 5.4174 0.0685 3.7208 5.0488 2.7319 8.0569 3.1230 3.1280 38.8768 7.6280 25.0636 67.3649 6.9232 3.9739 7.8089 0.6544 12.6329 0.6091 0.8528 4.1476 5.3103 6.7373 14.3597 4.4764 45.9672 1.1035 30.2855 0.2224 7.7680 58.4877 25.2886 6.4156 9.2082 0.7599 28.7105 18.9330 22.4077 29.4033 14.8718 21.8672 17.5127 4.0697 6.6067 10.2278 1.6122 5.5050
temp: 298.150 k
press: 1.00000 atm
elementType: 17 7 7 6 6 6 6 6 6 1 1 1 1 1 1 1 1 1
symmnumber: 1
zpe: 377624.7 jmol-1
zpe.correction: 0.143830 hartree
zpe.thermalcorrener: 0.153119 hartree
zpe.thermalcorrenthalpy: 0.154063 hartree
zpe.thermalcorrgfe: 0.108059 hartree
zpe.sumelectzpe: -802.905638 hartree
zpe.sumelectthermal: -802.896349 hartree
zpe.sumelectthermalent: -802.895404 hartree
zpe.sumelectthermalfe: -802.941409 hartree
dipole: 1.6839 -0.4602 0.6712
dipole: 1.8702
quadrupole: -80.6698 -54.0908 -61.3079
quadrupole: 1.7930 -1.3142 0.3316
quadrupole: -15.3136 11.2654 4.0483 1.7930 -1.3142 0.3316
hfenergy: -803.0494676 hartree
pointgroup: C01 [X(C6H9Cl1N2)]
dipole: 0.6589863 0.2084978 -0.2523063 debye
dipolederiv: -0.7103624 0.0085966 0.0078171 0.0349412 -0.1626655 -0.0047347 0.0558584 -0.0053014 -0.192614 -0.9616752 -0.0105445 0.1120098 0.0881282 -0.1408165 -0.0281318 0.0921897 0.0010027 -0.1785414 -0.6152169 0.0599976 0.0484801 0.0717955 -0.3836749 0.0086711 0.1143507 -0.0221175 -0.2786116 0.5430295 0.0153046 -0.0373281 -0.0324168 0.1532211 0.0012891 0.0829284 -0.0238274 0.2146102 0.6034543 0.0011488 -0.1293768 0.3080131 0.3798059 -0.0265571 -0.2114657 0.0401644 0.0222427 0.2272094 -0.0713515 -0.0911127 -0.3407163 -0.1287076 0.0367455 -0.1502035 -0.00509 -0.1814228 0.8080837 -0.0196396 -0.0703307 -0.0473678 0.1736791 0.0081804 -0.1126702 0.0065032 0.1230272 0.0094289 0.0365215 0.0305315 -0.0273889 -0.0975789 0.0075578 0.0447825 -0.0299751 0.1031115 -0.022114 -0.0799876 -0.0783114 -0.1171482 0.1354129 -0.0092693 -0.0416073 0.0171405 -0.1575569 -0.0035246 -0.005911 0.0237282 -0.0470164 -0.0058749 0.1092625 0.0160925 0.0684625 0.0089788 0.0280509 0.0065228 -0.0012657 0.0451996 -0.0278102 -0.09947 -0.0159323 -0.060895 0.0454753 0.0782218 -0.0914689 0.0497692 -0.0455396 0.0130304 0.0185115 0.0528795 0.0326533 0.2058553 -0.0183009 0.0448941 0.0390432 0.0140522 -0.0321449 -0.0896181 0.0092482 -0.0513361 0.044852 -0.0247363 -0.0339369 0.0613311 -0.0044351 -0.0016977 0.0957223 0.030078 0.0645474 0.0106447 -0.0029527 -0.1178528 0.0476554 -0.042181 0.0660454 0.0175052 0.0473169 0.0441542 0.1118284 0.0943102 0.0592686 0.0629664 0.0332666 0.0074098 -0.0217911 0.0556264 -0.0934148 -0.1006388 -0.0553907 0.099129 -0.1181473 0.0430514 0.0254764 -0.010023 -0.1202538 0.0387238 0.0194952 0.0224849 0.0993091 0.0425406 0.0657624 0.0268901 -0.0138503 0.0507817 -0.0213946 0.1792643 unknown
polarizability: 112.3456527|-3.2369173|83.8092168|-9.282706|0.6079393|52.5700255 unknown
InChI: InChI=1S/C6H9ClN2/c1-6-8-3-5-9(6)4-2-7/h3,5H,2,4H2,1H3
charge 0 multiplicity 1
18 atoms
Cl 3.935251 0.091519 0.115836
N  -0.176542 0.276677 -0.3110
N  -2.274651 -0.304284 0.31933
C  1.247705 0.167227 -0.658981
C  -1.056297 -0.779175 -0.020193
C  -0.889784 1.47596 -0.129391
C  2.120107 0.24829 0.607265
C  -0.684228 -2.230018 -0.109723
C  -2.175706 1.096973 0.25024
H  1.523906 0.978078 -1.354075
H  1.426289 -0.791588 -1.173394
H  -0.433109 2.448514 -0.297999
H  2.025483 1.217972 1.116633
H  1.922201 -0.578349 1.304746
H  -1.552234 -2.819502 0.222087
H  -0.436149 -2.536121 -1.144181
H  0.177965 -2.491015 0.532962
H  -3.029506 1.731844 0.474641
