program: Gaussian 09
title: 000117007
version: EM64L-G09RevD.01
frameworkgroup: C1[X(C9H14N2O2)]
method: RPBEPBE
basis: SDD
operation: Freq
keyword: #p
keyword: freq=noraman
keyword: PBEPBE/SDD
title: #p freq=noraman PBEPBE/SDD
converged: YES YES NO NO
title: Mulliken charges:
elementType: O O N N C C C C C C C C C H H H H H H H H H H H H H H
charge: -0.308097 -0.310833 -0.727946 -0.715999 0.139358 0.385825 -0.309261 -0.311408 -0.240250 -0.617875 0.583700 -0.479245 -0.489093 0.232095 0.206353 0.229184 0.212433 0.193154 0.200162 0.210864 0.282023 0.386524 0.299232 0.295775 0.207690 0.230831 0.214802
chargesum: 0.00000
title: Mulliken charges with hydrogens summed into heavy atoms:
elementType: O O N N C C C C C C C C C
charge: -0.308097 -0.310833 -0.059399 -0.120992 0.139358 0.385825 0.129188 -0.082224 0.165337 -0.417712 0.583700 -0.268381 0.164231
polarizability: 1.79721428e+02 1.47882927e+00 1.23657611e+02 1.43063195e+00 -2.58931839e+00 6.84740029e+01
1716.lowfreq: -8.3019 -0.0010 -0.0008 -0.0004 1.9409 5.4764 36.3926 64.2699 84.2963
frequency: 36.2024 64.2542 84.2879 94.2706 143.0294 193.0793 220.5868 220.8595 260.2543 282.8363 288.3785 314.1144 324.7931 337.1210 367.1599 404.7359 436.7249 457.3764 491.4896 550.1716 571.9742 629.5987 685.6414 717.0624 732.5797 742.4510 776.2814 794.3977 827.6641 865.4931 913.4557 950.9394 985.4725 1012.1408 1020.4223 1060.3089 1084.9321 1100.2517 1118.1712 1125.8893 1152.9652 1176.8224 1205.0699 1230.0541 1246.1497 1270.0571 1349.4058 1358.8292 1378.0191 1395.0930 1435.7341 1457.5525 1459.1010 1460.5027 1477.7188 1479.1418 1514.5147 1588.6453 1632.3529 1639.5120 1667.9873 2936.0517 2943.3004 2971.5654 3001.8628 3017.7733 3042.3680 3105.0802 3105.6092 3126.5460 3152.4306 3403.6803 3573.4406 3652.8572 3715.0911
redmass: 3.5898 3.4143 4.2247 3.3341 2.4815 3.9678 3.8134 1.6129 2.0647 1.2509 3.2278 3.6333 3.1791 1.0429 1.3476 2.8130 3.4952 2.7255 3.2601 4.0694 5.0745 3.0681 1.7019 1.6500 2.6820 4.9948 1.6336 2.6488 2.1767 3.4740 1.3545 2.6249 2.6264 2.6760 1.5617 3.1571 1.4216 1.9902 1.3868 1.4969 1.3614 2.3866 1.2356 1.8284 1.1965 1.4769 1.6380 1.9218 1.4457 6.7881 1.1449 1.0812 1.1112 1.1148 1.0601 3.4315 3.8198 6.0439 2.7987 1.5033 1.1774 1.0405 1.0484 1.0603 1.1045 1.1035 1.1046 1.0984 1.0907 1.0871 1.0966 1.0598 1.0446 1.0918 1.1040
irintensity: 2.0346 1.8537 4.1065 10.1414 1.8322 0.1343 4.3893 5.2360 5.2157 274.7440 0.4366 15.8048 1.8572 0.0153 123.0543 29.2160 7.2925 3.2843 11.1825 2.7660 5.1677 22.6843 57.0513 47.5205 3.2912 5.5555 44.9415 14.6253 73.0993 39.5309 0.9841 7.1163 34.2224 44.9393 2.8806 70.5214 2.1510 19.3736 10.4623 20.0103 12.3061 105.4752 5.9603 92.2092 20.1850 14.9131 11.2103 11.7309 7.4655 30.5769 1.7772 13.7883 15.7481 6.9789 8.1764 16.6650 180.1783 36.1004 72.4493 326.5440 140.9841 48.5015 101.2934 66.8149 74.2566 57.1371 31.3396 18.1195 37.0252 17.7300 16.1422 464.3490 54.3821 44.1925 16.9111
temp: 298.150 k
press: 1.00000 atm
elementType: 8 8 7 7 6 6 6 6 6 6 6 6 6 1 1 1 1 1 1 1 1 1 1 1 1 1 1
symmnumber: 1
zpe: 583835.9 jmol-1
zpe.correction: 0.222371 hartree
zpe.thermalcorrener: 0.236338 hartree
zpe.thermalcorrenthalpy: 0.237283 hartree
zpe.thermalcorrgfe: 0.181915 hartree
zpe.sumelectzpe: -610.280108 hartree
zpe.sumelectthermal: -610.266141 hartree
zpe.sumelectthermalent: -610.265196 hartree
zpe.sumelectthermalfe: -610.320564 hartree
dipole: -1.6315 -1.2698 1.3213
dipole: 2.4536
quadrupole: -48.1704 -67.3265 -83.7538
quadrupole: -3.3851 1.4321 1.2729
quadrupole: 18.2465 -0.9096 -17.3369 -3.3851 1.4321 1.2729
hfenergy: -610.502479 hartree
pointgroup: C01 [X(C9H14N2O2)]
dipole: 0.6149762 -0.2651964 -0.6951888 debye
polarizability: 178.9359345|-7.5518278|111.1907906|1.6758442|23.6773449|81.7263166 unknown
InChI: InChI=1S/C9H14N2O2/c1-12-4-5-13-9-3-2-7(10)6-8(9)11/h2-3,6H,4-5,10-11H2,1H3
charge 0 multiplicity 1
27 atoms
O  1.05643 0.689991 0.922799
O  3.240843 -0.705524 -0.500666
N  0.380336 -1.488149 -0.733641
N  -4.352166 -0.220011 -0.496846
C  -0.301134 0.495391 0.521136
C  -0.627323 -0.635519 -0.29603
C  1.941994 1.297682 -0.097031
C  -1.311413 1.350224 0.989867
C  3.315182 0.656739 0.049932
C  -1.992411 -0.852239 -0.62891
C  -3.012283 0.016907 -0.157781
C  -2.666706 1.128229 0.665178
C  4.409766 -1.516159 -0.163339
H  1.541998 1.129308 -1.115599
H  2.013014 2.389387 0.085127
H  -1.02351 2.191592 1.630383
H  3.588446 0.61946 1.12596
H  4.083635 1.242492 -0.500532
H  -2.260987 -1.716353 -1.251584
H  -3.445996 1.799709 1.042925
H  0.15398 -2.260036 -1.35379
H  1.365647 -1.306077 -0.506218
H  -5.087379 0.385419 -0.146476
H  -4.613887 -1.020762 -1.062755
H  5.339228 -1.07436 -0.579427
H  4.244464 -2.506737 -0.61567
H  4.519833 -1.624706 0.935588
