program: Gaussian 09
title: 000117012
version: EM64L-G09RevD.01
frameworkgroup: C1[X(C12H9F6N3O3)]
method: RPBEPBE
basis: SDD
operation: Freq
keyword: #p
keyword: freq=noraman
keyword: PBEPBE/SDD
title: #p freq=noraman PBEPBE/SDD
converged: YES YES NO NO
title: Mulliken charges:
elementType: F F F F F F O O O N N N C C C C C C C C C C C C H H H H H H H H H
charge: -0.163283 -0.157480 -0.163332 -0.157449 -0.163214 -0.157617 -0.242982 -0.243054 -0.243029 -0.212170 -0.212127 -0.212236 0.274284 0.274277 0.274033 -0.404454 -0.404189 -0.404356 -0.271178 -0.271372 -0.271242 0.341572 0.341612 0.341384 0.267328 0.270692 0.267318 0.270726 0.267480 0.270740 0.297683 0.297701 0.297931
chargesum: 0.00000
title: Mulliken charges with hydrogens summed into heavy atoms:
elementType: F F F F F F O O O N N N C C C C C C C C C C C C
charge: -0.163283 -0.157480 -0.163332 -0.157449 -0.163214 -0.157617 -0.242982 -0.243054 -0.243029 -0.212170 -0.212127 -0.212236 0.274284 0.274277 0.274033 0.133566 0.133856 0.133863 0.026506 0.026329 0.026689 0.341572 0.341612 0.341384
polarizability: 1.79341531e+02 7.80873638e-04 1.79261253e+02 -4.28360418e-02 -4.24371965e-02 1.26452446e+02
1716.lowfreq: -2.1879 0.0001 0.0005 0.0006 3.0068 6.2734 15.0975 16.3679 18.5917
frequency: 14.9859 16.2433 18.5591 29.5306 34.3554 34.6935 58.6838 62.3575 63.0974 98.7961 99.2373 134.3568 160.8085 160.9633 180.2783 187.8712 237.4840 238.1571 301.9058 318.2338 319.2936 335.3249 335.9413 366.9481 420.8134 421.2490 463.9815 464.1220 475.8693 526.3550 531.4776 531.8040 536.3626 536.6801 554.5930 571.1604 571.4641 608.8333 683.4204 703.9797 704.3791 717.1634 745.1580 792.9237 793.3933 805.5279 850.6469 852.0244 863.5192 900.4821 900.6651 961.6502 968.3326 968.9261 1074.8698 1075.7054 1092.4894 1115.2029 1120.0166 1120.3183 1162.9615 1168.9505 1169.6682 1203.8108 1277.0792 1278.9456 1284.4820 1301.4467 1301.8693 1322.3494 1360.5404 1361.3202 1372.8865 1401.6500 1401.7842 1448.3963 1450.6562 1452.7366 1610.0359 1610.2119 1669.2716 1733.1742 1733.5858 1735.8144 3044.4370 3044.5608 3045.0941 3122.9056 3122.9826 3123.9405 3184.3692 3185.0147 3185.3932
redmass: 13.0160 13.0591 13.5615 8.2474 9.5154 9.6198 9.3889 13.0057 12.9579 11.5305 11.5861 11.4138 10.3550 10.3804 8.2501 9.2984 7.1019 7.1263 7.7399 2.5440 2.5975 5.9010 5.6966 2.7411 12.7779 12.7675 9.5387 9.5500 8.8222 5.0756 6.2379 6.3916 7.0719 6.8975 7.0464 4.9056 4.9273 6.5967 6.8239 10.8390 10.8534 4.5916 6.2827 2.2895 2.2886 3.1300 1.9109 1.8783 1.7872 3.1796 3.1573 2.1525 2.8259 2.8269 2.8274 2.8378 3.2354 6.0005 6.2165 6.2745 3.5624 3.6533 3.6422 10.6253 1.7180 1.7099 1.6220 1.5346 1.5197 1.2953 1.6039 1.6045 1.3070 2.4665 2.4208 1.1028 1.1228 1.1206 10.8918 10.8821 9.8876 9.3773 9.3636 9.3953 1.0618 1.0619 1.0620 1.1026 1.1025 1.1024 1.0916 1.0916 1.0916
irintensity: 0.0383 0.0277 0.2757 0.3746 1.0645 1.0841 0.1015 0.3057 0.3027 0.0171 0.0195 10.7200 0.6033 0.6027 7.5023 0.9182 1.2887 1.3225 0.2373 0.9979 1.0983 22.9670 22.5817 0.6114 17.0409 16.9563 35.0585 35.3349 13.1826 3.0888 0.7360 0.7509 8.7606 8.7528 4.6098 6.6293 6.7612 1.2426 9.2222 0.2591 0.2863 1.1450 25.5706 74.0582 73.5673 17.1999 17.8317 18.5648 63.2199 82.1354 82.2528 3.7601 12.5026 12.4455 32.7274 33.1784 0.4216 151.7252 24.8929 26.0534 148.5634 18.0001 18.2112 2.7015 210.6547 221.9181 51.8693 41.6326 36.5960 7.6818 56.9714 56.3274 10.4872 270.3356 266.9150 39.5638 134.6541 126.8084 577.0797 577.5697 9.3176 237.2025 237.3412 225.5019 5.5996 8.9409 9.2865 1.2071 1.0305 1.1292 9.9528 9.9752 9.9769
temp: 298.150 k
press: 1.00000 atm
elementType: 9 9 9 9 9 9 8 8 8 7 7 7 6 6 6 6 6 6 6 6 6 6 6 6 1 1 1 1 1 1 1 1 1
symmnumber: 1
zpe: 554505.0 jmol-1
zpe.correction: 0.211200 hartree
zpe.thermalcorrener: 0.234282 hartree
zpe.thermalcorrenthalpy: 0.235226 hartree
zpe.thermalcorrgfe: 0.152445 hartree
zpe.sumelectzpe: -1449.855859 hartree
zpe.sumelectthermal: -1449.832777 hartree
zpe.sumelectthermalent: -1449.831833 hartree
zpe.sumelectthermalfe: -1449.914614 hartree
dipole: 0.0044 -0.0065 -3.3419
dipole: 3.3419
quadrupole: -148.5662 -148.5339 -134.5467
quadrupole: 0.0000 -0.0069 0.0372
quadrupole: -4.6839 -4.6516 9.3355 0.0000 -0.0069 0.0372
hfenergy: -1450.0670586 hartree
pointgroup: C01 [X(C12H9F6N3O3)]
dipole: -0.0047376 0.0008763 -1.3147966 debye
polarizability: 179.260639|-0.0065547|179.340969|-0.2429495|-0.0817217|126.4536218 unknown
InChI: InChI=1S/C12H9F6N3O3/c13-7(14)1-4-19-10(22)20(5-2-8(15)16)12(24)21(11(19)23)6-3-9(17)18/h1-3H,4-6H2
charge 0 multiplicity 1
33 atoms
F  3.482461 -3.148298 2.311432
F  2.30179 -4.253855 0.734939
F  0.992191 4.58304 2.321059
F  2.533968 4.120823 0.736603
F  -4.446891 -1.437881 2.352847
F  -4.829121 0.131263 0.773781
O  2.549492 0.886877 -1.030806
O  -0.513726 -2.65375 -1.016499
O  -2.048397 1.769793 -1.017696
N  1.04065 -0.895851 -1.044818
N  0.249575 1.354562 -1.043049
N  -1.303954 -0.456005 -1.032589
C  1.359894 0.47962 -1.036989
C  -0.272121 -1.419836 -1.028552
C  -1.101026 0.943094 -1.028631
C  2.187899 -1.855767 -1.030479
C  0.507145 2.828165 -1.025785
C  -2.708557 -0.969823 -1.004565
C  2.85186 -1.925575 0.326075
C  0.241054 3.433908 0.333895
C  -3.088376 -1.507455 0.35664
C  2.871487 -3.039729 1.076908
C  1.199085 4.004913 1.083236
C  -4.057803 -0.966599 1.113697
H  1.783691 -2.833075 -1.33372
H  2.913822 -1.501038 -1.781109
H  1.554327 2.967898 -1.332914
H  -0.166285 3.281642 -1.772173
H  -3.35579 -0.131687 -1.303024
H  -2.771354 -1.777217 -1.753206
H  3.361979 -1.036827 0.706527
H  -0.782065 3.429845 0.718796
H  -2.568802 -2.391472 0.735169
