program: Gaussian 09
title: 000117083
version: EM64L-G09RevD.01
frameworkgroup: C1[X(C19H18O4)]
method: RPBEPBE
basis: SDD
operation: Freq
keyword: #pfreq=noraman
keyword: PBEPBE/SDD
title: #p freq=noraman PBEPBE/SDD
converged: YES YES NO NO
title: Mulliken charges:
elementType: O O O O C C C C C C C C C C C C C C C C C C C H H H H H H H H H H H H H H H H H H
charge: -0.253683 -0.183341 -0.225335 -0.203166 -0.652748 -0.646961 0.309382 0.239199 0.119177 0.132887 0.327590 -0.361749 -0.321477 0.350801 -0.360665 -0.393799 -0.352075 -0.332582 -0.247851 -0.229556 -0.249020 -0.223437 -0.681869 0.253182 0.261437 0.294110 0.254787 0.275423 0.273041 0.251591 0.258094 0.278258 0.230064 0.214451 0.216160 0.234138 0.230830 0.233927 0.211143 0.234064 0.235576
chargesum: 0.00000
title: Mulliken charges with hydrogens summed into heavy atoms:
elementType: O O O O C C C C C C C C C C C C C C C C C C C
charge: -0.253683 -0.183341 -0.225335 -0.203166 -0.138129 -0.098064 0.309382 0.239199 0.119177 0.132887 0.327590 -0.086325 -0.048436 0.350801 -0.109074 -0.135705 -0.073817 -0.102518 0.182761 0.004582 -0.018190 0.010491 -0.001087
polarizability: 3.38472150e+02 1.66705759e+01 1.89951445e+02 -3.10765985e+01 2.92703573e+00 1.63041205e+02
1716.lowfreq: -3.8234 -1.0165 -0.0006 0.0004 0.0007 7.4128 10.3895 11.1504 25.7191
frequency: 7.5258 10.7412 25.5889 37.9331 46.5931 49.6084 65.0916 104.4481 111.2554 116.3976 124.2264 131.4742 164.8052 207.3915 218.0592 245.0537 262.5147 284.9183 324.2695 356.5502 384.6267 399.4483 408.9132 415.6032 422.6011 438.6442 475.7042 499.5504 510.5520 530.6369 571.0325 591.7755 613.8182 624.9299 639.1034 685.0918 694.5876 708.3027 741.0448 765.7579 784.3599 796.8087 816.2655 834.5889 847.8992 853.4480 856.2465 886.2935 900.0864 937.0283 948.4780 973.8065 984.7196 989.5487 989.9793 992.4963 1007.9762 1011.4559 1017.2947 1030.8530 1046.3242 1077.8728 1086.8517 1115.8873 1127.6992 1134.5953 1150.1001 1163.2377 1174.3299 1186.5195 1190.3238 1241.4935 1249.0767 1262.7478 1278.9009 1279.8411 1299.5864 1313.4268 1318.3685 1363.6736 1374.3332 1389.2334 1401.6679 1422.0978 1435.7827 1436.5795 1451.6474 1461.8236 1475.8780 1480.3779 1486.3318 1502.7613 1550.3542 1572.2777 1579.1402 1599.1941 1612.2966 1616.8729 1629.9353 2965.3408 2999.4091 3002.0471 3026.9187 3029.0714 3058.8263 3096.9026 3106.4567 3109.2663 3127.5597 3135.4680 3147.3479 3147.3653 3147.9021 3158.4740 3168.5805 3169.7028 3173.4535
redmass: 5.5624 6.2942 5.2931 3.8955 4.7537 4.3683 5.8101 8.1427 5.0190 3.0440 3.3493 4.1053 5.0509 4.8071 3.8552 1.2420 4.6910 5.6002 3.7874 4.9365 4.1735 2.8090 3.5773 2.9999 4.0635 3.5885 5.1341 3.1199 4.7500 2.6989 4.6674 4.4223 6.4340 6.9466 5.2718 4.0681 1.7589 4.1147 4.0318 2.1445 4.1078 3.1548 1.2045 1.1783 3.5246 1.7678 1.2589 2.3852 3.5892 1.9800 1.9121 1.3804 1.3636 1.5791 4.1210 3.0299 2.0179 1.4938 3.0372 2.6913 2.4337 2.3835 1.5818 2.2130 1.3653 1.4344 1.4186 1.4520 1.0645 1.2658 1.1505 2.8523 1.3761 1.1428 2.2559 2.7864 2.2913 1.2962 1.3394 1.5643 3.0982 9.1868 1.2684 1.1249 4.4231 2.2284 1.1057 1.0395 1.0914 2.2379 1.1364 2.0842 8.8262 7.2684 7.3917 6.9735 6.4305 6.8191 7.9177 1.0555 1.0364 1.0603 1.1078 1.0581 1.0982 1.0989 1.1044 1.1016 1.0851 1.0881 1.0911 1.0906 1.0882 1.0960 1.0955 1.1012 1.0966
irintensity: 0.8329 2.0027 0.4567 0.3558 0.2967 1.5972 3.1869 4.9509 4.2091 0.1604 2.0955 3.5961 0.8123 9.2519 1.9524 0.5889 1.5845 0.9256 1.3067 0.5849 0.2842 0.1360 2.7329 0.3829 1.9233 1.5682 2.0331 6.2670 3.3753 42.2865 31.6664 75.6842 1.0527 1.4334 2.3809 3.3502 54.5949 1.0660 9.5453 44.7373 9.2039 17.3787 8.2299 5.8233 12.1708 59.3578 0.8011 1.7411 55.4487 61.7546 47.6451 1.3547 3.6711 0.9647 1.0048 8.2849 5.3223 2.6123 22.2913 96.2442 5.0123 158.8700 4.6963 0.5720 50.4213 5.3944 61.9383 448.3457 2.4857 41.7610 8.6499 278.7177 47.0521 0.0681 432.1664 83.1204 54.9884 7.6514 9.6850 0.5493 51.3563 2.2994 40.1607 33.0521 2.2880 26.1670 27.9173 12.6590 27.8412 2.3332 29.7977 26.6674 159.4578 105.8761 210.4978 78.2185 19.7715 191.2646 72.4059 35.9447 25.2456 3.9155 29.0706 3.8983 5.5137 26.8121 9.5949 32.1843 4.4852 7.5783 14.0575 11.3782 1.6290 18.2189 13.8752 22.7610 6.6697
temp: 298.150 k
press: 1.00000 atm
elementType: 8 8 8 8 6 6 6 6 6 6 6 6 6 6 6 6 6 6 6 6 6 6 6 1 1 1 1 1 1 1 1 1 1 1 1 1 1 1 1 1 1
symmnumber: 1
zpe: 842083.3 jmol-1
zpe.correction: 0.320733 hartree
zpe.thermalcorrener: 0.342468 hartree
zpe.thermalcorrenthalpy: 0.343412 hartree
zpe.thermalcorrgfe: 0.264642 hartree
zpe.sumelectzpe: -1034.056230 hartree
zpe.sumelectthermal: -1034.034495 hartree
zpe.sumelectthermalent: -1034.033551 hartree
zpe.sumelectthermalfe: -1034.112321 hartree
dipole: -2.4941 1.4427 -1.9475
dipole: 3.4778
quadrupole: -77.9151 -141.9058 -138.7444
quadrupole: 5.8553 -15.0998 -3.4437
quadrupole: 41.6066 -22.3840 -19.2226 5.8553 -15.0998 -3.4437
hfenergy: -1034.3769628 hartree
pointgroup: C01 [X(C19H18O4)]
dipole: -1.0606086 0.5725814 0.6476051 debye
polarizability: 331.1528745|27.6580146|167.0658044|40.0035199|-6.4836728|193.2461206 unknown
InChI: InChI=1S/C19H18O4/c1-2-23-17-10-8-15(9-11-17)19(22)13-16(20)12-18(21)14-6-4-3-5-7-14/h3-11H,2,12-13H2,1H3
charge 0 multiplicity 1
41 atoms
O  -5.585447 1.06224 -1.50156
O  1.149793 1.522826 -0.232426
O  -1.017484 -1.314585 2.417253
O  2.911891 -1.298052 -1.55804
C  0.11431 0.758937 1.842274
C  1.816008 -0.712986 0.522466
C  -2.242768 0.125022 0.914183
C  1.054377 0.615692 0.631729
C  -1.076749 -0.22729 1.765625
C  2.993815 -0.676553 -0.460372
C  4.229138 0.088768 -0.088902
C  -3.371792 -0.740378 0.922481
C  -2.275441 1.282288 0.079229
C  -4.521698 0.689856 -0.684191
C  -4.505893 -0.470419 0.139808
C  -3.398963 1.559996 -0.711637
C  5.291997 0.147598 -1.031374
C  4.377712 0.744932 1.162157
C  -6.789461 0.197856 -1.533428
C  6.475512 0.848211 -0.730765
C  5.563935 1.446477 1.46436
C  6.614896 1.4998 0.519376
C  -7.767522 0.844456 -2.509051
H  0.663445 0.504824 2.765486
H  -0.228006 1.805093 1.888415
H  1.099498 -1.471044 0.150264
H  2.126587 -1.048502 1.528982
H  -3.332734 -1.629701 1.560504
H  -1.414396 1.956312 0.024986
H  -5.359634 -1.153247 0.172079
H  -3.434602 2.437667 -1.363368
H  5.157487 -0.363383 -1.990456
H  3.57365 0.714643 1.905953
H  -7.21718 0.133216 -0.512605
H  -6.497532 -0.818864 -1.865069
H  7.288291 0.890818 -1.463853
H  5.671129 1.950546 2.430926
H  7.535575 2.045488 0.754607
H  -8.690439 0.240205 -2.574102
H  -8.037517 1.86063 -2.175391
H  -7.324091 0.915308 -3.516552
