program: Gaussian 09
title: 000016264
version: EM64L-G09RevD.01
frameworkgroup: C1[X(C8H7Br)]
method: RPBEPBE
basis: SDD
operation: Freq
keyword: #pfreq=noraman
keyword: PBEPBE/SDD
title: #p freq=noraman PBEPBE/SDD
converged: YES YES NO NO
title: Mulliken charges:
elementType: Br C C C C C C C C H H H H H H H
charge: -0.003062 0.527919 -0.368472 -0.368670 -0.193863 -0.235975 -0.231864 -0.171259 -0.564604 0.229833 0.251482 0.232176 0.237668 0.226644 0.219962 0.212085
chargesum: 0.00000
title: Mulliken charges with hydrogens summed into heavy atoms:
elementType: Br C C C C C C C C
charge: -0.003062 0.527919 -0.368472 -0.138838 0.057619 -0.003799 0.005804 0.055385 -0.132557
polarizability: 1.29642353e+02 2.74178782e-01 1.37885831e+02 9.23301706e-01 3.30353043e-01 3.77669483e+01
1716.lowfreq: -0.0002 0.0001 0.0004 5.4837 11.3434 12.2059 40.3042 122.2265 172.9181
frequency: 40.2135 122.2230 172.9176 225.7560 265.0026 304.6053 422.0509 468.0842 489.5559 559.9524 643.2351 646.1565 744.2962 776.2368 781.3290 868.7990 938.5824 953.6679 987.5485 999.8908 1015.4821 1018.0081 1056.1972 1119.5346 1174.6677 1213.5790 1277.6630 1314.9106 1363.4218 1422.2145 1433.7377 1459.5600 1563.5553 1597.8954 1640.4259 3102.2665 3128.6163 3134.8556 3147.8788 3161.7001 3175.8030 3206.6745
redmass: 2.2027 3.5829 5.4050 3.0329 5.2753 5.5881 2.5327 4.7313 3.3710 3.4791 2.8227 3.5405 1.5730 3.1755 2.1082 1.4643 1.3436 1.3791 1.3439 7.1771 1.1604 1.8258 1.7139 1.8127 1.0704 1.7743 1.6841 1.2961 5.0152 2.3096 1.3640 2.1546 5.5891 6.6646 4.2761 1.0608 1.0917 1.0852 1.0899 1.0953 1.1000 1.1135
irintensity: 0.0371 0.0736 0.3342 5.6759 1.1527 2.8452 10.8170 1.8248 0.5495 6.7088 5.7366 14.0742 32.2926 18.9944 43.3669 0.4621 73.7910 8.9280 0.0504 66.8238 18.9172 10.0901 0.7212 3.0903 0.2424 4.9693 3.0329 1.4798 6.5943 39.7954 4.4269 25.7750 9.3423 8.1037 10.4102 6.3198 7.5754 1.1564 7.6127 18.0264 14.3662 19.1450
temp: 298.150 k
press: 1.00000 atm
elementType: 35 6 6 6 6 6 6 6 6 1 1 1 1 1 1 1
symmnumber: 1
zpe: 317840.3 jmol-1
zpe.correction: 0.121059 hartree
zpe.thermalcorrener: 0.129382 hartree
zpe.thermalcorrenthalpy: 0.130326 hartree
zpe.thermalcorrgfe: 0.086142 hartree
zpe.sumelectzpe: -321.851643 hartree
zpe.sumelectthermal: -321.843320 hartree
zpe.sumelectthermalent: -321.842376 hartree
zpe.sumelectthermalfe: -321.886560 hartree
dipole: 1.9847 -0.3616 -0.0164
dipole: 2.0175
quadrupole: -55.8226 -53.3168 -67.7630
quadrupole: -0.7674 0.4054 -0.1810
quadrupole: 3.1448 5.6507 -8.7955 -0.7674 0.4054 -0.1810
hfenergy: -321.9727016 hartree
pointgroup: C01 [X(C8H7Br1)]
dipole: -0.3861936 0.6784486 -0.1434015 debye
dipolederiv: -0.1962669 0.2807919 -0.061043 0.2454096 -0.5463755 0.1037475 -0.0535748 0.1075899 -0.0685718 0.0809984 0.2745426 -0.0641489 0.1543682 -0.2832024 0.0910372 -0.0626464 0.0798685 0.0714237 0.2333454 -0.6061642 0.1355303 -0.4403632 0.9315347 -0.2224881 0.0908932 -0.2318089 -0.1016784 -0.0623822 -0.0859202 0.030484 0.0643176 0.0410588 -0.0188089 0.0114223 -0.0313215 -0.1380954 -0.1510649 0.1891768 -0.0364889 0.2545939 -0.1719881 0.0266049 -0.0451825 0.0267485 -0.0966051 -0.0250341 -0.0765881 0.0204827 -0.1088762 0.0276996 -0.0350196 0.0228425 -0.0352783 -0.1412179 0.0196646 0.0258479 0.0097591 -0.0306283 0.039991 -0.0384846 0.0164697 -0.0321659 -0.1527157 0.2449938 0.0959089 0.0056666 -0.147484 0.0126041 -0.0762101 0.095946 -0.0353414 -0.107122 -0.1264082 -0.1541602 0.0805864 -0.1414315 -0.0707455 -0.1388418 0.0778971 -0.1277687 -0.3326033 0.0492716 -0.0728215 0.002163 -0.0456377 -0.0674403 0.0302674 -0.0039659 0.0334641 0.1405885 0.0696463 -0.0537728 0.005196 -0.0721457 -0.0282183 0.0308638 0.0087099 0.029642 0.1564356 0.0141622 0.0858141 -0.0240154 0.1050273 -0.0447341 0.0423679 -0.0279206 0.0380859 0.1539218 -0.1106707 -0.0046075 -0.0156817 -0.0087109 0.0717072 0.0163781 -0.0155451 0.0181276 0.1626072 0.0203006 0.0204245 -0.0182273 0.1063447 0.0228417 0.0648545 -0.0447436 0.0465099 0.1338531 -0.1056742 -0.0227541 -0.0201178 0.0002474 0.0880325 0.0364761 -0.0319664 0.0264953 0.1728564 0.0451183 0.1042818 -0.0501452 0.0649689 -0.0227652 0.0872556 -0.0386353 0.0871532 0.1469231 unknown
polarizability: 136.6997312|3.4947873|126.8567519|3.4040759|-18.4240149|41.7386492 unknown
InChI: InChI=1S/C8H7Br/c1-2-7-5-3-4-6-8(7)9/h2-6H,1H2
charge 0 multiplicity 1
16 atoms
Br 0.831837 -2.709503 0.568703
C  0.490698 0.197131 0.022783
C  -0.177457 -1.047109 0.212624
C  -0.346827 1.32598 -0.230949
C  -1.580139 -1.175419 0.148958
C  -1.74709 1.219827 -0.300825
C  -2.371439 -0.035514 -0.1105
C  1.962019 0.32458 0.095749
C  2.700871 1.417323 -0.242222
H  0.124358 2.305839 -0.361452
H  -2.047433 -2.152566 0.299184
H  -2.35284 2.111198 -0.495365
H  -3.461049 -0.13194 -0.158443
H  2.49483 -0.565719 0.451705
H  3.790902 1.404567 -0.142782
H  2.261359 2.342126 -0.633668
