program: Gaussian 09
title: 000116685
version: EM64L-G09RevD.01
frameworkgroup: C1[X(C8H17ClNO)]
method: RPBEPBE
basis: SDD
operation: Freq
keyword: #p
keyword: freq=noraman
keyword: PBEPBE/SDD
title: #p freq=noraman PBEPBE/SDD
converged: YES YES NO NO
title: Mulliken charges:
elementType: Cl O N C C C C C C C C H H H H H H H H H H H H H H H H H
charge: -0.014421 -0.443998 -0.103622 -0.322067 -0.427027 -0.073434 -0.563134 -0.556492 -0.648774 -0.038554 -0.533100 0.268717 0.280363 0.312326 0.258667 0.262461 0.313540 0.256779 0.252058 0.282774 0.260914 0.267158 0.323730 0.280955 0.233927 0.373683 0.257538 0.239033
chargesum: 1.00000
title: Mulliken charges with hydrogens summed into heavy atoms:
elementType: Cl O N C C C C C C C C
charge: -0.014421 -0.070316 -0.103622 0.227013 0.143967 0.189027 0.259243 0.254354 -0.044089 0.195374 -0.036530
polarizability: 1.28629095e+02 1.12115749e+01 9.79381265e+01 1.23597344e+00 3.93312577e+00 8.07643537e+01
1716.lowfreq: -14.4369 -0.0027 -0.0025 -0.0021 4.1116 7.3448 27.3436 69.5300 87.8362
frequency: 26.5293 69.5143 87.8204 100.0860 146.1196 180.4509 198.8652 208.5470 234.3019 259.9926 306.1342 307.0570 330.1879 369.6162 418.6039 436.0250 453.0454 468.2461 519.9714 551.5722 612.2785 668.4849 767.9576 828.9480 851.3934 866.8841 901.2802 937.4211 951.5848 980.7546 983.7576 989.8512 1008.9118 1041.2142 1061.7233 1099.4669 1123.4729 1144.4724 1167.7729 1194.7083 1207.3090 1229.8240 1276.4871 1294.3084 1296.3603 1308.7160 1336.3936 1350.4337 1366.9450 1386.7066 1415.9120 1434.3148 1440.0865 1443.1569 1447.1430 1467.9619 1469.2229 1482.9704 1486.2976 1503.2508 1654.4528 3021.5411 3022.6277 3024.9416 3027.7251 3029.0007 3069.4337 3095.0782 3096.5134 3100.1644 3117.3668 3136.0353 3141.1415 3149.7605 3154.6953 3157.9301 3213.2008 3484.7690
redmass: 5.3016 3.5399 2.7370 5.0574 2.8689 2.3571 3.8628 1.1723 2.7963 1.2123 2.3306 2.7175 2.8794 2.6673 1.8775 1.3260 2.1851 1.8652 2.7280 3.9082 1.9084 3.8124 3.2327 3.3531 3.3373 2.2431 1.8564 1.9211 2.3310 1.5515 1.7276 1.2567 1.3847 1.9362 1.8555 1.2918 1.4552 1.8167 1.4081 1.4820 1.6736 1.3414 1.4044 1.3896 1.2383 1.2521 1.2292 1.2904 1.1343 1.3386 1.1596 1.1484 1.1754 1.0957 1.0617 1.0752 1.0681 1.0492 1.0813 1.0558 4.4160 1.0436 1.0501 1.0465 1.0611 1.0641 1.0587 1.0968 1.1045 1.0706 1.0963 1.1053 1.1047 1.1047 1.1115 1.1057 1.1149 1.0658
irintensity: 2.0572 1.5220 1.0784 3.0029 3.3498 2.2619 4.9296 4.3421 1.8146 0.4837 9.8726 3.7759 18.0988 0.1653 52.5105 76.3863 8.4654 5.0735 3.8283 12.0330 8.9436 18.8350 8.6756 25.8613 39.9492 5.7876 25.3066 21.7254 17.0527 9.4086 17.2490 54.5887 38.5030 25.6507 11.4687 1.2306 23.7316 5.5509 34.9299 3.5585 2.2123 12.3678 16.3948 0.7726 5.4910 5.9528 5.9248 1.2928 17.9500 14.2396 26.9751 13.6950 17.8367 16.5302 3.0866 14.9581 11.4363 31.9150 27.6068 62.8031 1.5749 9.6462 2.4246 2.9490 11.2581 4.3639 5.7186 0.4340 3.1849 5.3843 9.4417 1.5563 10.1528 2.0149 0.6476 3.5612 5.2747 49.3381
temp: 298.150 k
press: 1.00000 atm
elementType: 17 8 7 6 6 6 6 6 6 6 6 1 1 1 1 1 1 1 1 1 1 1 1 1 1 1 1 1
symmnumber: 1
zpe: 641169.7 jmol-1
zpe.correction: 0.244209 hartree
zpe.thermalcorrener: 0.257771 hartree
zpe.thermalcorrenthalpy: 0.258715 hartree
zpe.thermalcorrgfe: 0.203827 hartree
zpe.sumelectzpe: -903.888290 hartree
zpe.sumelectthermal: -903.874727 hartree
zpe.sumelectthermalent: -903.873783 hartree
zpe.sumelectthermalfe: -903.928672 hartree
dipole: -5.0367 1.2345 -1.5708
dipole: 5.4185
quadrupole: -52.6448 -57.1974 -71.3510
quadrupole: -4.5578 2.9837 2.6581
quadrupole: 7.7529 3.2004 -10.9533 -4.5578 2.9837 2.6581
hfenergy: -904.1324983 hartree
pointgroup: C01 [X(C8H17Cl1N1O1)]
dipole: -1.9962256 -0.3907578 0.6379075 debye
polarizability: 128.9287214|-10.6613369|98.3752332|2.6018554|-0.0512295|80.0276201 unknown
InChI: InChI=1S/C8H17ClNO/c1-4-5-10(2,3)7-8(11)6-9/h4,8,11H,1,5-7H2,2-3H3
charge 1 multiplicity 1
28 atoms
Cl 3.798674 0.04692 0.600784
O  1.576809 -0.240324 -1.578066
N  -0.716766 -0.902155 0.249601
C  0.512204 -0.067809 0.681382
C  -1.597404 -0.153735 -0.808759
C  1.272519 0.651603 -0.461475
C  -0.279769 -2.239105 -0.361913
C  -1.545977 -1.190749 1.500075
C  2.530465 1.35023 0.076469
C  -2.137462 1.171789 -0.333114
C  -3.46301 1.419286 -0.184355
H  0.144288 0.686836 1.398201
H  1.18739 -0.760393 1.214081
H  -0.95482 -0.053196 -1.700861
H  -2.419715 -0.849149 -1.048365
H  0.633303 1.444299 -0.893188
H  0.324339 -2.029072 -1.254447
H  0.314814 -2.792454 0.381697
H  -1.18223 -2.814926 -0.619775
H  -1.954776 -0.248354 1.892039
H  -2.37132 -1.868257 1.232308
H  -0.900835 -1.67096 2.251947
H  3.022905 1.93331 -0.714364
H  2.341746 1.973557 0.963065
H  -1.423312 1.992722 -0.183128
H  2.491976 -0.614695 -1.458917
H  -3.828444 2.413211 0.093615
H  -4.224891 0.648966 -0.358537
