program: Gaussian 09
title: 000116833
version: EM64L-G09RevD.01
frameworkgroup: C1[X(C19H17N3)]
method: RPBEPBE
basis: SDD
operation: Freq
keyword: #pfreq=noraman
keyword: PBEPBE/SDD
title: #p freq=noraman PBEPBE/SDD
converged: YES YES NO NO
title: Mulliken charges:
elementType: N N N C C C C C C C C C C C C C C C C C C C H H H H H H H H H H H H H H H H H
charge: -0.156426 -0.014422 -0.028221 -0.582301 0.475356 0.477193 -0.625824 0.332224 -0.419343 0.383959 -0.665220 -0.354758 -0.428546 -0.370618 -0.847957 -0.360493 -0.215645 -0.228923 -0.238358 0.267741 -0.265858 -0.267962 0.245126 0.251818 0.247068 0.242151 0.236752 0.251693 0.246283 0.250873 0.232057 0.253419 0.238264 0.241779 0.241083 0.259547 0.230588 0.231929 0.233973
chargesum: 0.00000
title: Mulliken charges with hydrogens summed into heavy atoms:
elementType: N N N C C C C C C C C C C C C C C C C C C C
charge: -0.156426 -0.014422 -0.028221 -0.085356 0.475356 0.477193 -0.378756 0.332224 -0.177192 0.383959 0.069508 -0.103885 -0.196489 -0.117199 -0.126831 -0.100946 0.014942 0.003005 -0.004384 0.267741 -0.265858 -0.267962
polarizability: 4.53061307e+02 4.12958945e+01 2.21291818e+02 -2.53805426e+01 1.74096266e+00 1.46785627e+02
1716.lowfreq: -5.2995 -3.4472 -0.0004 0.0002 0.0005 4.5192 17.3565 20.3662 23.1431
frequency: 15.7124 20.2233 23.0779 41.0296 53.7087 86.5896 107.0079 129.4636 137.3342 160.4375 173.5669 188.7004 199.0334 211.5647 237.0425 242.2828 251.0780 288.3433 311.9053 376.1804 402.5460 405.1076 434.8106 441.8324 451.8308 466.4652 490.5323 508.1215 536.8359 555.0880 591.4474 599.4950 614.8774 621.4214 641.6252 697.9876 705.5466 740.3859 743.0502 774.1544 792.5827 815.2226 825.9564 855.3313 863.0607 883.8247 909.2797 942.8865 956.0036 968.7574 979.1041 988.9565 989.8688 1000.3522 1019.8360 1028.2142 1044.3013 1087.2452 1103.0255 1106.6872 1113.7178 1159.6877 1174.2757 1190.2413 1198.2412 1207.2332 1227.3680 1253.0328 1272.3392 1309.3189 1315.7950 1349.4102 1358.8921 1383.5248 1388.7929 1397.7394 1403.0944 1437.6418 1442.3371 1459.5778 1473.9408 1476.5064 1479.4535 1484.7495 1492.2312 1498.6452 1514.3733 1542.1307 1569.1909 1595.8016 1614.1676 1630.8201 2149.1864 2164.2578 2959.5525 2979.4035 2986.2924 3046.3085 3050.3669 3057.6646 3088.1045 3103.9722 3113.6752 3127.9644 3137.9114 3138.7998 3149.6897 3155.4192 3157.9005 3166.3204 3184.0950
redmass: 4.2045 5.4882 7.4205 4.4644 4.7787 7.3221 3.3847 8.6971 5.2141 2.6083 1.9748 1.1738 2.7960 2.9955 3.4995 4.0140 5.1196 4.3793 3.8023 4.2876 2.9325 3.4803 3.0248 4.1037 3.7323 3.2920 4.5791 4.1417 4.7141 4.9803 2.9637 11.3585 5.8674 5.3155 6.9611 4.9489 2.0983 2.1601 2.1008 6.5568 3.7358 1.6448 3.7454 1.2507 1.4888 3.8254 1.5025 1.4203 2.2389 1.3750 1.3896 1.9266 4.8749 1.3705 1.7206 2.1105 1.5726 1.5704 1.9445 1.5266 2.0323 4.7463 1.0542 1.1131 2.8686 1.3654 2.4870 1.6453 2.0289 1.3935 1.6028 1.3760 2.6624 3.8674 2.3697 1.7061 1.5826 1.5248 2.1432 1.5114 1.0968 1.0669 1.4402 1.5196 1.4431 1.4758 2.0208 4.4040 5.3483 6.0524 5.9120 6.0237 12.6165 12.6304 1.0406 1.0381 1.0658 1.0959 1.0954 1.0976 1.0982 1.0984 1.0881 1.0860 1.0876 1.0910 1.0959 1.0886 1.0897 1.1015 1.0945
irintensity: 0.5541 0.8342 0.1959 0.1720 0.3283 0.9243 1.4771 3.3131 4.8958 1.8461 0.6081 0.8756 2.9200 2.0236 2.0616 2.0519 3.8588 0.5958 2.3324 2.5800 0.0113 1.4330 4.2414 3.9347 2.4167 6.1037 4.9366 4.4233 1.7615 2.5021 6.9543 2.4795 3.3703 12.4444 3.1181 6.6773 29.7218 24.5167 23.1023 1.4963 6.8109 25.2431 11.0865 1.1273 23.9674 31.1244 1.2705 16.1938 36.0654 0.6959 0.5978 4.3601 1.8346 1.0627 17.2389 6.8093 6.8100 4.4951 52.3283 10.9012 10.0350 10.0724 0.0801 10.0544 1.9552 1.2501 48.4911 105.4585 41.3316 13.1081 98.3586 48.2361 20.4176 178.8479 58.5474 68.3754 7.1044 24.3061 40.1095 2.1882 40.0290 6.7102 50.7061 15.8422 8.7012 6.0453 248.1285 105.4479 512.4711 0.6497 16.4500 558.2893 26.4162 186.4327 87.6734 20.2777 53.6538 23.6006 5.4717 13.5848 17.4930 12.6966 9.5634 2.1470 6.7300 9.9176 40.7316 8.1430 15.8113 25.2012 8.4151
temp: 298.150 k
press: 1.00000 atm
elementType: 7 7 7 6 6 6 6 6 6 6 6 6 6 6 6 6 6 6 6 6 6 6 1 1 1 1 1 1 1 1 1 1 1 1 1 1 1 1 1
symmnumber: 1
zpe: 808490.7 jmol-1
zpe.correction: 0.307938 hartree
zpe.thermalcorrener: 0.328541 hartree
zpe.thermalcorrenthalpy: 0.329485 hartree
zpe.thermalcorrgfe: 0.255603 hartree
zpe.sumelectzpe: -896.898533 hartree
zpe.sumelectthermal: -896.877931 hartree
zpe.sumelectthermalent: -896.876986 hartree
zpe.sumelectthermalfe: -896.950868 hartree
dipole: 10.3327 6.2966 0.1213
dipole: 12.1007
quadrupole: -165.8844 -131.2228 -126.7368
quadrupole: -19.2463 -3.2093 -3.7945
quadrupole: -24.6030 10.0585 14.5446 -19.2463 -3.2093 -3.7945
hfenergy: -897.2064713 hartree
pointgroup: C01 [X(C19H17N3)]
dipole: 4.062013 1.9427821 1.5462031 debye
polarizability: 455.6743303|33.6817501|198.0885741|20.5782816|35.1926106|167.3758472 unknown
InChI: InChI=1S/C19H17N3/c1-15-10-19(9-8-18(15)11-17(12-20)13-21)22(2)14-16-6-4-3-5-7-16/h3-11H,14H2,1-2H3
charge 0 multiplicity 1
39 atoms
N  1.93067 1.485106 0.155077
N  -7.058998 -0.580113 -0.524359
N  -3.538587 -2.131289 -2.749282
C  2.916663 1.004388 -0.833324
C  0.573633 1.195153 0.070764
C  3.798402 -0.147029 -0.342159
C  -0.371596 1.866319 0.915224
C  -1.749253 1.602713 0.866368
C  0.057521 0.214544 -0.843007
C  -2.261055 0.620142 -0.063997
C  2.454538 2.352947 1.223432
C  -1.309368 -0.051261 -0.900566
C  5.151928 -0.223067 -0.754418
C  3.275052 -1.163935 0.495004
C  -2.667728 2.377742 1.7991
C  -3.682129 0.360979 -0.100674
C  5.968058 -1.303403 -0.348988
C  4.090643 -2.242532 0.904097
C  5.438448 -2.317479 0.481603
C  -4.447682 -0.507544 -0.885916
C  -5.873026 -0.550859 -0.691998
C  -3.937392 -1.387284 -1.89832
H  3.562745 1.856834 -1.122286
H  2.382542 0.710015 -1.753485
H  -0.019413 2.629571 1.614643
H  0.728433 -0.362263 -1.485519
H  2.197417 3.418716 1.057401
H  3.551462 2.257832 1.253034
H  2.066915 2.047253 2.211871
H  -1.652086 -0.812727 -1.605132
H  5.570115 0.563307 -1.396146
H  2.233559 -1.107545 0.831376
H  -2.089496 3.080524 2.421226
H  -3.418353 2.969151 1.242366
H  -3.21917 1.707139 2.484425
H  -4.284052 0.942128 0.60824
H  7.013145 -1.350817 -0.674653
H  3.675246 -3.02442 1.549593
H  6.06965 -3.154632 0.799285
