program: Gaussian 09
title: 000116426
version: EM64L-G09RevD.01
frameworkgroup: C1[X(C10H12O4)]
method: RPBEPBE
basis: SDD
operation: Freq
keyword: #pfreq=noraman
keyword: PBEPBE/SDD
title: #p freq=noraman PBEPBE/SDD
converged: YES YES NO NO
title: Mulliken charges:
elementType: O O O O C C C C C C C C C C H H H H H H H H H H H H
charge: -0.325343 -0.427802 -0.472104 -0.218270 0.004059 -0.391687 -0.365755 0.270583 0.182543 -0.360181 -0.330414 -0.227937 -0.243965 -0.205037 0.269102 0.201828 0.222874 0.215600 0.235092 0.317749 0.275698 0.231316 0.235743 0.353580 0.358375 0.194354
chargesum: 0.00000
title: Mulliken charges with hydrogens summed into heavy atoms:
elementType: O O O O C C C C C C C C C C
charge: -0.325343 -0.074223 -0.113730 -0.218270 0.273161 0.033015 0.084938 0.270583 0.182543 -0.042433 -0.054716 0.003379 -0.008221 -0.010684
polarizability: 1.54255462e+02 -3.21331741e+00 1.42962252e+02 3.66417686e+00 1.32005799e+01 7.15182327e+01
1716.lowfreq: -7.0469 -0.0008 -0.0007 -0.0006 5.1594 6.9383 24.4890 40.6461 64.8867
frequency: 24.2657 40.6188 64.8735 109.3152 130.0953 143.0496 158.4601 177.3110 212.6410 262.2427 281.4109 290.9344 325.4977 394.9814 424.8400 428.4501 454.0831 487.6500 525.2208 527.3521 598.8186 645.9735 731.0205 751.1604 778.1577 817.1027 887.3069 896.1786 908.8743 955.1292 971.4653 995.0639 1003.3035 1005.3380 1018.7378 1040.5009 1046.1858 1094.3415 1116.7274 1175.2840 1188.6897 1203.2308 1204.9767 1217.3369 1222.3668 1264.2154 1293.1407 1310.3594 1343.0991 1361.8239 1382.6935 1400.1665 1403.5352 1440.4298 1457.0448 1469.5113 1481.7126 1573.3095 1593.4199 1615.8044 2939.1319 2953.2055 2959.4985 3017.8348 3023.9392 3082.5986 3131.6884 3142.8520 3150.7387 3168.4587 3550.8567 3582.0636
redmass: 3.7910 6.5446 5.4948 5.7351 4.3556 3.1780 3.1344 4.5251 3.4448 3.4536 3.8695 1.2038 3.6273 3.8955 1.1951 7.1604 3.1295 3.6477 3.5481 3.9969 5.9410 5.8392 4.3056 3.7512 1.2261 4.7688 3.2683 1.4396 1.9240 4.6195 1.5190 1.4987 1.4810 2.9478 2.8910 2.3710 2.1846 2.4377 2.0269 1.2015 1.2562 1.1839 1.8149 1.6149 1.7466 1.2857 1.5531 1.3217 1.2808 1.7971 1.2751 2.5581 1.4442 2.4191 1.0831 1.0774 2.1988 7.4956 6.0263 6.1358 1.0858 1.0649 1.0616 1.1050 1.0850 1.0949 1.0865 1.0896 1.0955 1.1003 1.0654 1.0666
irintensity: 3.9911 2.5113 0.3733 4.4989 3.2048 3.9293 5.8536 5.7665 5.5155 4.5284 2.7281 158.7338 28.2337 9.9187 163.3814 1.5973 8.8536 12.7853 4.7947 9.2026 8.9490 25.9537 0.4749 2.6856 90.7450 26.8079 54.7080 6.3106 27.8055 64.3792 4.2123 11.4353 1.0217 74.3025 6.8236 32.8081 25.9251 36.0174 13.3096 32.4616 22.2451 16.2463 74.8819 59.9987 138.4458 8.8233 71.1157 11.3052 8.4860 1.4775 20.7196 58.0815 1.0013 55.6942 3.5778 11.2210 77.7669 65.9419 183.8604 91.5021 78.7124 8.7630 94.9613 38.1519 18.3653 25.3692 12.7367 4.2649 2.5296 26.6957 8.4540 7.2049
temp: 298.150 k
press: 1.00000 atm
elementType: 8 8 8 8 6 6 6 6 6 6 6 6 6 6 1 1 1 1 1 1 1 1 1 1 1 1
symmnumber: 1
zpe: 532515.8 jmol-1
zpe.correction: 0.202825 hartree
zpe.thermalcorrener: 0.216909 hartree
zpe.thermalcorrenthalpy: 0.217853 hartree
zpe.thermalcorrgfe: 0.160644 hartree
zpe.sumelectzpe: -688.060490 hartree
zpe.sumelectthermal: -688.046406 hartree
zpe.sumelectthermalent: -688.045461 hartree
zpe.sumelectthermalfe: -688.102671 hartree
dipole: -3.4292 4.8264 -2.2184
dipole: 6.3226
quadrupole: -83.2105 -84.7003 -84.1598
quadrupole: 4.4496 14.0798 -1.3281
quadrupole: 0.8130 -0.6768 -0.1362 4.4496 14.0798 -1.3281
hfenergy: -688.2633143 hartree
pointgroup: C01 [X(C10H12O4)]
dipole: -1.0860405 -0.0582666 -2.2371275 debye
dipolederiv: -1.8479765 -0.2615918 0.049643 -0.420873 -0.3342763 0.0105931 0.346957 0.0121208 -0.3579532 -0.2887293 -0.1747316 -0.031941 -0.1583528 -0.5056693 -0.0399267 0.0783921 -0.047701 -0.8320513 -0.6939145 0.0786545 -0.0564916 0.0661337 -0.3941175 0.2901283 -0.0413492 0.2508677 -0.5234907 -0.6923459 0.3116357 -0.4504435 0.132807 -0.5403276 0.2748316 -0.2318313 0.3062522 -0.7580643 1.0587621 0.0602685 0.1020222 -0.1858885 0.1823052 0.0094683 0.207578 0.0653289 0.1405627 0.2177905 0.0555757 0.0384444 0.066982 0.4272775 0.0878759 0.0048257 0.1160294 0.5835249 0.2942683 -0.0156763 0.0603642 0.0192995 0.3129177 -0.2366267 -0.0181121 -0.2142608 0.3750632 1.3032703 0.1481855 0.0201056 0.6810174 0.2636425 -0.1138055 -0.5991207 -0.1977653 0.2354303 -0.3012479 -0.1901963 0.1846676 0.1126156 -0.3773915 0.4524778 -0.1688711 0.3936064 -0.5576406 -0.3118416 -0.0467274 0.0491937 -0.3180805 -0.2515599 0.0244986 0.3606027 0.0619845 -0.1992294 0.0042492 0.154526 -0.1710968 -0.0869961 0.0554417 -0.196045 0.1210374 -0.1515489 0.1164066 0.3388539 -0.0379299 0.1245437 0.0656466 0.0043162 -0.131631 -0.0031045 -0.1565291 0.0671996 -0.1105331 0.1438796 -0.1617585 0.1813221 -0.1988795 0.0500783 -0.2048311 0.0463675 -0.2808377 0.7351311 -0.0857024 0.226695 -0.1571555 0.6763775 -0.7230934 0.3250751 -0.7023454 1.0368008 -0.0201903 -0.0513632 0.0069491 0.0487112 -0.0681211 0.0145994 -0.0612284 0.0100061 0.0588171 0.0849619 0.0352622 -0.0044239 -0.0454993 -0.2099852 -0.0413938 0.0136255 -0.0368566 -0.0198141 -0.1068239 0.0143759 -0.0669164 0.0603276 0.0708012 0.0087221 -0.0382917 -0.0006601 0.0273209 -0.1710867 -0.1293985 -0.0022695 -0.101651 -0.0194292 0.0638539 -0.0009456 0.0508242 0.0271206 -0.0107499 0.1317983 0.0476234 0.1243896 -0.0578546 0.0232936 0.047787 0.0121036 -0.0057251 0.1331031 0.0332453 0.0085802 0.041513 0.1508516 0.0461037 0.0116424 0.0468142 0.1316661 0.0113512 0.0029484 -0.0299782 0.0358949 0.1302109 0.0321802 -0.0706305 0.0233428 0.1085101 0.0874766 -0.0045533 -0.0073414 -0.0159579 0.0460156 0.1239401 0.0097249 0.1296955 -0.0099528 -0.0640897 -0.0828002 0.0548017 -0.0754212 0.0985031 0.0713348 0.0496303 0.0697455 0.0919021 0.1125353 0.0903814 -0.0659277 0.0835296 0.2855976 -0.0299812 -0.1280928 -0.049525 0.3853528 0.3854731 -0.0518149 -0.0352896 -0.0780673 0.2072912 -0.1311519 -0.0595118 -0.0919684 0.1134383 -0.1476973 -0.1282512 0.1102442 -0.0762468 0.0460622 0.0596757 0.049043 0.0540714 0.0456432 unknown
polarizability: 152.2130192|8.3135471|93.7877206|9.4522696|-34.6268161|122.7352069 unknown
InChI: InChI=1S/C10H12O4/c11-5-8-3-1-2-4-10(8)14-9(6-12)7-13/h1-5,9,12-13H,6-7H2
charge 0 multiplicity 1
26 atoms
O  -0.725636 -0.450258 0.488424
O  -2.73227 0.182681 2.35657
O  -2.4353 0.450517 -2.364533
O  2.734729 -1.488869 2.395136
C  -2.05934 -0.025645 -0.021153
C  -3.024456 -0.470074 1.086436
C  -2.393064 -0.652973 -1.389014
C  0.443575 0.133295 -0.029723
C  1.663743 -0.2197 0.628256
C  0.45179 1.0158 -1.137387
C  2.881321 0.345785 0.162647
C  1.679418 1.561867 -1.571765
C  2.897955 1.235686 -0.926102
C  1.682421 -1.155716 1.777989
H  -2.077931 1.077432 -0.111711
H  -2.994845 -1.577439 1.182871
H  -4.049532 -0.160815 0.82188
H  -3.378009 -1.163196 -1.346237
H  -1.618459 -1.401977 -1.649002
H  -0.473774 1.25353 -1.671368
H  3.799227 0.060156 0.688736
H  1.680869 2.246368 -2.427689
H  3.840573 1.668624 -1.275506
H  -1.78093 0.005369 2.574707
H  -2.630677 0.098258 -3.268162
H  0.6935 -1.570005 2.078998
