program: Gaussian 09
title: 000116733
version: EM64L-G09RevD.01
frameworkgroup: C1[X(C11H22N3O6P)]
method: RPBEPBE
basis: SDD
operation: Freq
keyword: #p
keyword: freq=noraman
keyword: PBEPBE/SDD
title: #p freq=noraman PBEPBE/SDD
converged: YES YES NO NO
title: Mulliken charges:
elementType: P O O O O O O N N N C C C C C C C C C C C H H H H H H H H H H H H H H H H H H H H H H
charge: 1.152708 -0.694930 -0.665335 -0.324209 -0.272767 -0.422183 -0.226432 -0.358386 -0.635031 -0.403522 -0.368750 -0.221686 -0.769615 0.234380 -0.201439 -0.884416 0.245493 -0.726253 -0.114111 -0.677940 0.160652 0.256518 0.211212 0.243611 0.269089 0.324517 0.262592 0.366115 0.263936 0.252098 0.272547 0.297106 0.288136 0.240733 0.215946 0.239736 0.282982 0.397391 0.384231 0.214447 0.244051 0.258236 0.388540
chargesum: 0.00000
title: Mulliken charges with hydrogens summed into heavy atoms:
elementType: P O O O O O O N N N C C C C C C C C C C C
charge: 1.152708 -0.310699 -0.665335 -0.324209 -0.272767 -0.033642 -0.226432 0.007729 -0.049789 -0.006131 0.098981 0.021926 -0.176010 0.234380 0.061153 -0.095835 0.245493 -0.029839 0.168872 0.038793 0.160652
polarizability: 2.06968311e+02 -9.48165933e+00 1.95926473e+02 -2.32170550e+00 2.70975627e+00 1.49865765e+02
1716.lowfreq: -10.1018 -6.4102 -5.4956 0.0006 0.0008 0.0011 10.3677 15.9644 17.1951
frequency: 7.7819 15.8555 17.1380 23.9507 28.2393 41.3936 62.5820 69.8115 78.4116 86.8195 89.8925 108.7680 129.7371 133.3939 147.3964 159.6122 192.1417 206.0272 215.4450 223.1136 236.6964 251.0893 263.2697 268.0234 286.8346 299.6021 305.0867 313.3041 318.6473 355.0058 364.2249 414.7052 429.8158 443.1966 524.3725 529.0517 540.1041 553.8569 611.7816 624.1219 640.1063 676.0163 697.7383 704.8928 727.0921 738.6890 750.8587 767.3999 788.3967 791.1016 818.8518 864.0954 879.4087 906.6535 913.1202 929.9786 933.9098 970.1506 977.9337 1010.7378 1025.2197 1037.0614 1048.9667 1066.7550 1075.1964 1092.3725 1102.6088 1120.3002 1126.1791 1147.6276 1157.5631 1162.7027 1207.7176 1229.9354 1233.7522 1264.9165 1270.2269 1301.3068 1306.1751 1312.6723 1325.3439 1331.5685 1332.4315 1342.2526 1359.8725 1376.8519 1394.5796 1428.5186 1435.9273 1441.1035 1458.4077 1465.0034 1467.5704 1470.5218 1477.3385 1479.4936 1509.6883 1579.8595 1620.2516 1645.7807 1666.9040 2977.7703 2995.4617 2997.9473 2999.0067 3000.7593 3013.5267 3014.6687 3019.2657 3043.3113 3100.3128 3101.6469 3104.1494 3109.6665 3114.9394 3133.5599 3140.9464 3364.4205 3380.6045 3443.9720 3520.8097 3570.3703 3595.0685
redmass: 5.6672 4.6344 5.7927 4.4440 7.9007 3.9447 2.8004 7.0513 5.3415 3.1413 5.1910 2.9323 2.8624 1.2160 3.1690 3.5686 1.2022 2.5619 2.7184 3.3900 1.1211 2.3908 2.4467 2.0498 4.2130 2.3411 4.8174 4.7509 3.2124 4.7843 3.9738 4.3528 4.0501 3.6313 3.6494 5.1502 3.6902 3.9125 1.3625 5.4122 3.6146 5.8671 3.2501 2.6595 2.1171 2.2067 3.1368 1.3090 1.7960 2.7593 1.0980 3.1896 2.8461 2.1868 1.6631 1.9622 1.6148 1.8276 1.3213 2.0424 2.5971 2.2149 2.3046 2.3173 2.5479 1.8378 2.2611 1.9009 1.7921 2.8719 2.0542 1.6105 1.7396 1.8336 1.4161 1.2674 1.3693 1.7232 1.1722 1.7780 1.4269 1.1753 1.4078 1.3370 1.3676 1.1997 1.2301 1.0522 1.0648 1.0492 1.1379 1.1335 1.0764 1.3468 1.0511 1.4232 1.7986 8.9888 6.1366 1.0968 9.0239 1.0628 1.0809 1.0361 1.0805 1.0386 1.0813 1.0318 1.0601 1.1016 1.1010 1.1026 1.1012 1.0989 1.1016 1.1015 1.1021 1.0821 1.0774 1.0467 1.0642 1.0963 1.0662
irintensity: 2.6447 1.1891 1.3140 3.7431 0.2761 2.1281 45.4308 9.6944 4.3815 23.2988 2.6475 20.7516 5.8807 2.6138 4.1742 0.3046 0.2991 2.2320 4.1679 7.2162 0.3390 27.1926 42.3226 19.6851 2.4918 5.7956 28.5214 27.2625 23.9053 23.2569 11.4754 14.6525 5.3560 4.8351 33.9720 8.1350 3.8809 16.5390 116.2432 29.0428 61.4035 132.2863 32.6786 4.5948 26.1213 129.6660 67.8505 163.7751 17.9370 11.4229 89.7133 16.1217 11.7872 3.3056 17.9106 92.7163 27.3726 6.5462 26.5766 110.0538 52.3370 4.8892 40.3778 64.2785 5.7984 18.1295 60.9356 29.9970 17.5028 18.4503 23.1417 27.5179 4.9743 11.1282 38.6181 2.1170 6.5009 28.2990 4.6322 13.3378 5.0191 27.3165 0.9596 1.0424 9.9416 26.1769 36.9569 8.2387 1.8749 16.4927 57.7732 6.4298 44.1332 127.1133 16.0137 104.2394 311.5886 89.6424 277.8490 46.0365 241.7814 7.6975 14.4396 12.7318 11.6031 20.4102 14.1700 3.3891 10.8295 17.1941 19.5174 12.7679 21.1591 19.5258 11.4739 6.2219 3.3843 213.4065 120.5476 1.2843 28.1927 6.4774 51.9211
temp: 298.150 k
press: 1.00000 atm
elementType: 15 8 8 8 8 8 8 7 7 7 6 6 6 6 6 6 6 6 6 6 6 1 1 1 1 1 1 1 1 1 1 1 1 1 1 1 1 1 1 1 1 1 1
symmnumber: 1
zpe: 897786.3 jmol-1
zpe.correction: 0.341949 hartree
zpe.thermalcorrener: 0.368293 hartree
zpe.thermalcorrenthalpy: 0.369237 hartree
zpe.thermalcorrgfe: 0.279750 hartree
zpe.sumelectzpe: -1387.566910 hartree
zpe.sumelectthermal: -1387.540566 hartree
zpe.sumelectthermalent: -1387.539622 hartree
zpe.sumelectthermalfe: -1387.629108 hartree
dipole: -2.2792 -2.2360 0.7351
dipole: 3.2764
quadrupole: -178.9905 -126.7133 -121.7572
quadrupole: -5.5334 -0.4590 3.1190
quadrupole: -36.5035 15.7737 20.7298 -5.5334 -0.4590 3.1190
hfenergy: -1387.9088587 hartree
pointgroup: C01[X(C11H22N3O6P1)]
dipole: -1.0964378 0.6522044 -0.1845743 debye
polarizability: 199.6831953|8.1701097|194.5458598|8.8185004|19.3047159|158.5314931 unknown
InChI: InChI=1S/C11H22N3O6P/c1-6(9(15)14-7(2)11(17)18)13-10(16)8(12)4-5-21(3,19)20/h6-8,13-14,17,19H,4-5,12H2,1-3H3
charge 0 multiplicity 1
43 atoms
P  -4.256617 -2.054661 -1.235607
O  -3.911634 -3.781192 -1.241396
O  -5.68364 -1.680387 -0.596672
O  -0.182562 0.108925 -0.71676
O  3.434934 2.246891 1.187655
O  2.995145 -1.763179 -1.433389
O  4.897377 -2.467288 -0.302551
N  0.091371 2.050576 0.542311
N  -2.2616 1.919068 1.732814
N  2.614029 0.38849 0.044686
C  -3.022289 0.09522 0.118877
C  -1.884205 0.677368 1.008909
C  -2.784816 -1.372307 -0.297464
C  -0.586204 0.917677 0.192616
C  1.334945 2.487166 -0.126547
C  -4.053265 -1.647452 -3.043426
C  2.562525 1.7070 0.437872
C  1.526765 4.000822 0.030827
C  3.695619 -0.483095 0.519203
C  3.440993 -1.022864 1.956291
C  3.956662 -1.65449 -0.421593
H  -3.970006 0.159372 0.687483
H  -3.134902 0.7366 -0.778522
H  -1.626682 -0.081156 1.77587
H  -2.661344 -2.020333 0.589794
H  -1.879694 -1.463126 -0.919436
H  1.23017 2.212751 -1.194832
H  -0.347374 2.591365 1.305511
H  -3.125438 -2.105671 -3.419667
H  -4.017143 -0.554525 -3.179607
H  -4.916605 -2.05597 -3.591263
H  -2.695158 1.747616 2.645288
H  -2.836196 2.556423 1.167426
H  2.420314 4.328564 -0.524978
H  0.64767 4.545004 -0.357201
H  1.691828 4.265161 1.089378
H  4.622185 0.122184 0.556822
H  1.841508 0.000556 -0.521808
H  -4.655882 -4.312253 -0.859061
H  2.51183 -1.618366 1.991409
H  4.285192 -1.653748 2.281714
H  3.347314 -0.164476 2.641246
H  3.19368 -2.55756 -1.999023
