program: Gaussian 09
title: 000116401
version: EM64L-G09RevD.01
frameworkgroup: C1[X(C13H26N2S)]
method: RPBEPBE
basis: SDD
operation: Freq
keyword: #p
keyword: freq=noraman
keyword: PBEPBE/SDD
title: #p freq=noraman PBEPBE/SDD
converged: YES YES NO NO
title: Mulliken charges:
elementType: S N N C C C C C C C C C C C C C H H H H H H H H H H H H H H H H H H H H H H H H H H
charge: 0.289306 -0.570332 0.010466 -0.385590 -0.386305 -0.384573 -0.384219 -0.379279 -0.380838 -0.372256 -0.371765 -0.359352 -0.339397 -0.394729 -0.670964 -0.360098 0.194073 0.195071 0.195277 0.194886 0.192904 0.193878 0.195802 0.195415 0.191331 0.195480 0.197398 0.197198 0.188121 0.189874 0.199941 0.200187 0.180630 0.218468 0.221418 0.221379 0.177419 0.206438 0.283849 0.283947 0.271492 0.258050
chargesum: 0.00000
title: Mulliken charges with hydrogens summed into heavy atoms:
elementType: S N N C C C C C C C C C C C C C
charge: 0.289306 -0.040791 0.010466 0.003554 0.003858 0.002208 0.006997 0.007532 0.013758 0.005740 0.028362 0.039746 0.103401 -0.010872 -0.103169 -0.360098
polarizability: 2.56159645e+02 1.01544411e+01 1.46652732e+02 6.01236526e-01 9.42927300e-01 1.22101078e+02
1716.lowfreq: -2.9740 -0.0015 -0.0010 -0.0002 6.5341 15.9480 19.1412 23.4213 38.6890
frequency: 17.4288 19.2325 34.1644 46.2896 51.9250 59.0385 76.3068 85.7737 90.0371 106.9465 117.0682 124.9674 135.8841 145.0048 146.7325 158.4530 163.0948 205.2338 233.3766 260.6702 296.9258 356.4928 381.3304 392.3433 428.9741 460.0441 485.0378 506.7498 609.8754 631.2574 669.6141 723.6348 726.6933 733.7741 745.9128 763.2338 790.3497 829.9034 878.1262 927.3592 949.2285 979.8737 981.5654 990.4284 1015.9411 1023.7498 1032.4809 1051.0771 1063.5659 1069.0191 1075.5511 1080.3926 1081.9312 1084.2423 1101.7555 1121.1773 1185.0064 1195.0966 1207.6029 1218.8296 1232.0143 1241.7566 1253.7001 1264.7196 1275.7469 1279.2167 1284.4975 1285.9381 1293.8669 1296.1109 1299.4279 1301.9808 1303.8357 1320.3865 1338.6186 1350.0945 1354.9272 1357.0591 1358.5308 1387.7262 1449.8704 1461.2127 1461.6872 1464.2875 1465.0987 1466.7474 1469.6528 1475.3513 1481.4877 1486.6386 1490.1548 1494.6595 1637.8954 2100.1419 2862.0084 2950.8295 2951.3215 2952.8100 2953.9656 2956.5175 2959.1841 2962.4172 2966.1532 2969.9275 2984.5133 2986.1293 2988.5638 2994.0695 3001.2612 3006.7045 3010.8922 3021.6036 3032.2260 3040.6501 3041.2489 3048.2214 3053.3049 3125.6613 3448.2954 3575.7024
redmass: 5.2804 5.5188 4.4050 3.2034 5.2575 2.1788 2.1098 2.0336 5.8177 1.9737 2.2076 6.0083 1.9200 2.5809 3.6112 1.9906 2.0905 3.6133 1.5110 2.4681 3.6506 3.6998 12.6095 4.0494 4.5228 4.0493 3.1724 2.9862 1.2826 13.9449 6.8493 1.0601 1.0694 1.0816 1.0959 1.1246 1.1721 1.2178 1.2453 1.3091 2.1375 2.3754 2.4154 2.6011 4.1590 1.3606 2.2620 3.3924 2.6637 1.0760 2.4271 2.1971 2.2462 2.4326 3.5351 2.0763 1.7571 1.3440 1.4627 1.3455 1.3512 1.3091 1.3087 1.2741 1.2846 1.0203 1.1474 1.0908 1.0666 1.1721 1.2430 1.1058 1.1098 1.3369 1.3971 1.4804 1.6440 1.6206 1.6305 1.4675 1.0941 1.0735 1.0720 1.0736 1.0646 1.0674 1.0871 1.0958 1.0986 1.0994 1.1002 1.0915 1.0941 12.7174 1.0715 1.0587 1.0585 1.0593 1.0597 1.0611 1.0609 1.0603 1.0596 1.0586 1.0960 1.0589 1.0971 1.0986 1.0999 1.0870 1.1019 1.1040 1.1044 1.0561 1.1042 1.1028 1.1048 1.1107 1.0448 1.0973
irintensity: 0.5496 0.6231 1.9561 0.5591 2.1106 2.3085 0.9186 0.5308 1.2431 1.6051 0.2755 0.7430 0.4207 0.0591 1.6229 0.2899 0.1472 4.1901 30.1959 28.5901 2.5688 2.5379 0.2458 0.9812 1.3441 18.2523 0.2137 5.9126 220.8153 7.4635 11.0315 15.7825 0.7123 10.6967 0.4622 5.1345 0.3082 0.3494 0.2910 0.1676 0.6705 1.6240 1.5825 0.2422 0.2795 0.5409 2.1418 4.8010 0.4488 0.3275 0.8879 0.1622 0.3379 0.2915 3.8836 23.7039 4.9872 17.1523 4.7524 0.3011 3.8839 4.7851 3.7727 1.8989 10.0002 0.7881 2.0233 3.3485 0.1202 3.2830 1.9794 0.4021 0.0277 9.0680 6.6727 2.7002 0.0782 0.1485 0.4246 16.8989 5.0168 0.1084 0.1125 0.2403 0.2257 1.4894 1.0629 0.0218 2.7292 0.2674 29.8057 9.1998 40.2574 37.0445 113.9883 0.4770 0.5203 1.4371 0.3585 1.9317 2.0972 3.4178 99.8340 176.1351 0.6960 40.9703 1.0727 1.1812 3.1317 34.2789 1.5478 0.3388 0.0633 12.5538 32.8198 187.1333 168.0002 16.8709 2.3253 0.1539
temp: 298.150 k
press: 1.00000 atm
elementType: 16 7 7 6 6 6 6 6 6 6 6 6 6 6 6 6 1 1 1 1 1 1 1 1 1 1 1 1 1 1 1 1 1 1 1 1 1 1 1 1 1 1
symmnumber: 1
zpe: 971684.7 jmol-1
zpe.correction: 0.370095 hartree
zpe.thermalcorrener: 0.391708 hartree
zpe.thermalcorrenthalpy: 0.392652 hartree
zpe.thermalcorrgfe: 0.315221 hartree
zpe.sumelectzpe: -1017.194115 hartree
zpe.sumelectthermal: -1017.172502 hartree
zpe.sumelectthermalent: -1017.171558 hartree
zpe.sumelectthermalfe: -1017.248989 hartree
dipole: -5.7069 -1.5875 1.0506
dipole: 6.0161
quadrupole: -174.3018 -112.3393 -107.6618
quadrupole: -4.8101 -10.3890 2.2406
quadrupole: -42.8675 19.0950 23.7725 -4.8101 -10.3890 2.2406
hfenergy: -1017.5642101 hartree
pointgroup: C01 [X(C13H26N2S1)]
dipole: -2.2523641 -0.6052922 0.4033777 debye
polarizability: 256.422963|8.6253118|146.3190692|0.4229129|1.6085676|122.1714225 unknown
InChI: InChI=1S/C13H26N2S/c14-11-9-7-5-3-1-2-4-6-8-10-12-16-13-15/h1-12,14H2
charge 0 multiplicity 1
42 atoms
S  7.305034 -0.949167 -0.029552
N  -9.565854 0.53443 0.02334
N  9.489544 1.020123 -0.005541
C  -1.924413 0.345471 0.00912
C  -0.649799 -0.528121 -0.001307
C  -3.231696 -0.47856 0.006203
C  0.65569 0.298877 0.00167
C  -4.504958 0.396993 0.01568
C  1.930211 -0.574793 -0.009261
C  -5.813819 -0.424821 0.013754
C  3.232781 0.258202 -0.005244
C  -7.081924 0.457299 0.016995
C  4.503932 -0.627944 -0.017307
C  -8.389178 -0.360773 0.022324
C  5.775367 0.230375 -0.010859
C  8.582538 0.234621 -0.015518
H  -1.90956 1.004877 0.902206
H  -1.914598 1.018728 -0.873549
H  -0.664699 -1.187059 -0.894612
H  -0.659799 -1.201283 0.881418
H  -3.242911 -1.151597 0.889172
H  -3.247237 -1.138061 -0.886778
H  0.664122 0.971975 -0.880985
H  0.669327 0.957483 0.89517
H  -4.488955 1.057109 0.908297
H  -4.49451 1.06955 -0.867243
H  1.917058 -1.231829 -0.903486
H  1.921597 -1.24744 0.873341
H  -5.825262 -1.096136 0.898275
H  -5.828698 -1.085846 -0.878171
H  3.245704 0.913159 0.890032
H  3.240616 0.929798 -0.888133
H  -7.063205 1.120385 0.908808
H  -7.091353 1.121028 -0.869098
H  4.49065 -1.276084 -0.915521
H  4.494568 -1.295061 0.866924
H  -8.360244 -1.073146 0.885052
H  -8.430437 -0.977092 -0.897016
H  5.862177 0.84408 0.899659
H  5.856777 0.865701 -0.906931
H  -10.461577 0.05848 -0.123489
H  -9.599508 1.163971 0.832461
