program: Gaussian 09
title: 000116362
version: EM64L-G09RevD.01
frameworkgroup: C1[X(C8H10N5O3)]
method: RPBEPBE
basis: SDD
operation: Freq
keyword: #p
keyword: freq=noraman
keyword: PBEPBE/SDD
title: #p freq=noraman PBEPBE/SDD
converged: YES YES NO NO
title: Mulliken charges:
elementType: O O O N N N N N C C C C C C C C H H H H H H H H H H
charge: -0.229197 -0.153468 -0.158716 -0.041004 -0.147869 -0.152516 -0.312042 0.062285 0.265177 -0.029947 0.395297 -0.612948 -0.599476 -0.261772 -0.265955 0.313044 0.343077 0.314207 0.257846 0.268067 0.286090 0.264542 0.284855 0.290733 0.321891 0.297800
chargesum: 1.00000
title: Mulliken charges with hydrogens summed into heavy atoms:
elementType: O O O N N N N N C C C C C C C C
charge: -0.229197 -0.153468 -0.158716 -0.041004 -0.147869 -0.152516 -0.014242 0.062285 0.265177 0.313130 0.395297 0.227171 0.236012 0.028961 0.055936 0.313044
polarizability: 2.46005543e+02 1.16028806e+01 1.41791155e+02 -3.66564934e+00 -5.46973707e+00 6.60110207e+01
1716.lowfreq: -11.9572 -5.2665 -2.4883 -0.0008 -0.0007 -0.0004 11.1980 48.7617 62.0929
frequency: 9.8779 48.7546 62.0824 86.2220 99.5737 103.8028 148.6263 161.4623 177.9589 206.4211 239.3032 251.7236 281.3690 318.3396 347.2922 383.2927 443.2534 509.4886 534.3112 549.9887 560.0575 587.3214 627.0043 651.9467 659.7499 684.8370 733.3468 736.1722 792.8190 817.2484 827.5019 839.3570 905.3819 907.4494 914.8427 996.1886 1030.0154 1043.2866 1064.6998 1123.7753 1125.6384 1127.9464 1171.2775 1182.8461 1206.9951 1221.2947 1267.7789 1297.3864 1330.8378 1349.9374 1378.0033 1401.4263 1430.8265 1438.0788 1459.3723 1469.9163 1478.7124 1484.1798 1515.0888 1567.4463 1603.1604 1741.9543 2997.9959 3011.7645 3100.3257 3107.9585 3111.6313 3138.6816 3244.9423 3249.3203 3259.2241 3513.7772
redmass: 4.9677 7.2189 6.4145 3.6944 3.0212 1.2136 4.6936 3.8901 5.1827 1.2840 3.9801 4.5803 4.0840 3.9902 6.2883 5.7420 8.0142 6.7248 4.1465 4.9847 4.8744 4.1670 4.0758 2.0559 1.8739 8.2640 6.8476 8.6448 4.0019 1.2757 1.4395 2.1183 1.7573 2.3767 7.3089 4.1269 1.4137 2.2241 1.7596 1.3015 2.4135 1.9796 2.6753 2.9423 2.2851 3.4835 1.9266 5.8099 4.9515 3.8858 13.2075 3.2775 1.1634 1.3736 1.0377 1.0882 1.1193 1.0719 6.6524 4.6474 7.9881 6.8704 1.0325 1.0342 1.1045 1.1039 1.1011 1.1024 1.0966 1.1033 1.1050 1.0823
irintensity: 7.0228 1.4623 4.5418 5.4765 12.3527 0.1178 1.4051 0.4894 0.2354 3.0624 0.6398 1.6522 4.5870 2.7823 1.6958 0.9320 1.8849 3.1125 6.6825 14.5162 1.8467 12.5390 32.2114 15.4345 94.6369 11.0380 71.1185 5.7482 28.6722 75.3132 12.0981 143.5290 29.9728 51.2297 10.5897 162.8108 40.3665 14.7089 45.4063 0.8412 14.8402 11.3833 53.7472 120.0940 3.6236 192.0585 65.8237 6.0500 5.5541 1.1659 121.8111 30.1346 45.1088 6.6961 28.4459 17.6259 19.9681 38.9821 35.9108 148.9872 159.9231 533.6843 13.0928 3.6702 9.3046 2.0251 2.9791 0.2739 0.5771 35.1520 25.2496 111.6027
temp: 298.150 k
press: 1.00000 atm
elementType: 8 8 8 7 7 7 7 7 6 6 6 6 6 6 6 6 1 1 1 1 1 1 1 1 1 1
symmnumber: 1
zpe: 499153.0 jmol-1
zpe.correction: 0.190117 hartree
zpe.thermalcorrener: 0.205453 hartree
zpe.thermalcorrenthalpy: 0.206397 hartree
zpe.thermalcorrgfe: 0.145285 hartree
zpe.sumelectzpe: -808.679839 hartree
zpe.sumelectthermal: -808.664503 hartree
zpe.sumelectthermalent: -808.663559 hartree
zpe.sumelectthermalfe: -808.724671 hartree
dipole: -9.2810 0.5553 -2.1402
dipole: 9.5407
quadrupole: -70.0135 -66.9171 -88.7480
quadrupole: 26.0501 -2.9189 2.1885
quadrupole: 5.2127 8.3091 -13.5218 26.0501 -2.9189 2.1885
hfenergy: -808.869956 hartree
pointgroup: C01 [X(C8H10N5O3)]
dipole: 3.4516713 0.0623802 1.4736807 debye
dipolederiv: -0.3488341 -0.011994 0.1547437 0.0057582 -0.1080015 -0.1283508 0.0801035 -0.0950145 -0.4420633 -0.8836379 -0.0441647 -0.0135206 -0.0451308 -0.2154652 -0.0816985 -0.0638017 -0.0822743 -0.4183931 -0.4420861 0.0088531 0.0660746 -0.0363967 -0.2394636 -0.1527233 -0.1048013 -0.1632477 -0.6525809 -0.9575196 0.1299681 0.2076002 0.542273 0.210853 0.0823622 0.581825 0.0639714 0.0236608 -0.5994627 -0.2284213 -0.1766143 0.2907824 -0.2375973 -0.1050126 0.3705014 0.009461 -0.2533409 -1.4732378 0.0064185 0.1033504 -0.78393 -0.4016554 -0.2257184 -0.4480806 -0.2953586 -0.296703 -1.1692655 -0.3694524 -0.2808159 -0.7233304 -0.6425274 -0.0786736 -0.5250801 -0.0877959 -0.4875827 1.5842257 0.151143 0.2499662 0.2350965 0.3558753 0.3892136 0.6810574 0.4187573 1.3279801 1.6014282 0.6455868 0.4177111 0.9486518 0.6604411 0.3527256 0.6483828 0.3636684 0.4575962 1.687465 -0.102891 -0.232399 -0.0064733 -0.0581099 -0.1446031 -0.4080396 -0.1283925 -0.0211001 0.887892 0.0676403 -0.0544378 -0.1809884 0.0145356 0.0175732 -0.1194898 -0.037039 0.2866877 0.0089013 -0.1651693 -0.1211672 -0.1842483 0.2317781 0.0510335 -0.1381851 0.0704821 0.3320787 0.3684165 -0.1641309 -0.1697149 -0.2262277 0.163175 0.0198801 -0.1819234 0.0321017 0.2084458 -0.228106 -0.0270495 -0.0249102 0.0611454 -0.0960731 0.0538413 0.0806617 0.0566443 0.0215259 0.1235658 0.010939 -0.0099774 0.075069 -0.0649216 0.0440775 0.0843976 0.0644666 0.0653393 -0.2101975 -0.0499907 -0.2289562 -0.197209 0.0592493 -0.1145043 -0.6363354 -0.1648105 -0.2146157 0.1222548 -0.0060498 0.001887 -0.0350723 0.2022972 -0.0037291 -0.0385895 -0.0161287 0.1850046 0.0780002 -0.0625399 -0.0180862 -0.0016846 0.1436154 -0.0105111 0.0253178 -0.0053044 0.1483161 0.0735613 0.0318041 0.1193261 -0.0061181 0.0219791 0.082662 0.0919997 0.0282766 -0.0060455 0.0366372 0.1104657 -0.0165283 0.0891747 0.1015228 0.0154619 -0.0498921 0.024115 0.002778 0.0373392 0.0121889 0.0486346 -0.0045011 0.0062748 0.0757757 0.0536234 0.0208575 0.1012051 0.0672031 -0.0711453 -0.0529363 -0.0194797 0.0687605 -0.0728081 -0.0083486 -0.067647 0.0897384 0.0291994 0.0541264 -0.0023443 0.0386779 0.121435 0.0091313 -0.0375727 0.0537502 0.0065231 0.1416141 -0.0184325 -0.0587472 -0.020622 0.1825057 -0.0366362 -0.068557 -0.0367036 0.0910093 0.1303103 -0.011085 -0.0110198 -0.0278628 0.1940055 -0.023577 -0.0275499 -0.010247 0.1702032 0.3343331 0.1033821 0.1028816 0.2126463 0.3255115 -0.0151918 0.1583764 -0.0165885 0.2743329 unknown
polarizability: 243.4942573|17.9625031|86.9284446|10.9234175|34.5185599|123.3850168 unknown
InChI: InChI=1S/C8H10N5O3/c1-10-5-12(11(2)8(10)9)6-3-4-7(16-6)13(14)15/h3-5,9H,1-2H3
charge 1 multiplicity 1
26 atoms
O  -1.056039 -0.675667 -1.057999
O  -4.570004 -1.091917 -1.598844
O  -2.765016 -1.479888 -2.978958
N  0.938284 -0.244386 0.082867
N  1.753851 0.664558 0.798981
N  3.015389 -0.603504 -0.581204
N  4.08211 1.157751 0.89065
N  -3.309136 -1.125513 -1.867475
C  3.109784 0.475053 0.412768
C  1.729491 -0.986187 -0.731998
C  -0.463109 -0.295076 0.153506
C  1.269454 1.710251 1.698928
C  4.195801 -1.140318 -1.278678
C  -1.415432 -0.099337 1.145715
C  -2.691957 -0.36344 0.530044
C  -2.433797 -0.719509 -0.783478
H  1.347394 -1.755265 -1.398503
H  2.155759 2.330639 1.913468
H  0.897292 1.295214 2.650774
H  0.498462 2.333469 1.215002
H  4.689061 -0.335996 -1.850017
H  3.887303 -1.934748 -1.97418
H  4.904285 -1.560159 -0.545042
H  -1.248154 0.172402 2.18494
H  -3.67283 -0.312897 0.996463
H  5.048753 0.996875 0.580173
