program: Gaussian 09
title: 000116450
version: EM64L-G09RevD.01
frameworkgroup: C1[X(C14H25N3O2)]
method: RPBEPBE
basis: SDD
operation: Freq
keyword: #p
keyword: freq=noraman
keyword: PBEPBE/SDD
title: #p freq=noraman PBEPBE/SDD
converged: YES YES NO NO
title: Mulliken charges:
elementType: O O N N N C C C C C C C C C C C C C C H H H H H H H H H H H H H H H H H H H H H H H H H
charge: -0.394710 -0.183163 -0.238800 -0.252362 -0.338970 0.323118 0.586528 -0.482365 -0.599509 -0.567061 -0.570161 -0.552102 -0.551037 -0.595738 0.331662 -0.349160 -0.344235 0.275130 -0.586678 0.285372 0.271998 0.269747 0.292936 0.272044 0.306921 0.274701 0.270825 0.308606 0.272132 0.279193 0.279293 0.279174 0.281214 0.278406 0.280363 0.271611 0.293495 0.270893 0.272171 0.306828 0.352747 0.267713 0.280880 0.270348
chargesum: 2.00000
title: Mulliken charges with hydrogens summed into heavy atoms:
elementType: O O N N N C C C C C C C C C C C C C C
charge: -0.394710 -0.183163 -0.238800 -0.252362 0.013777 0.323118 0.586528 -0.196992 0.235173 0.286605 0.281403 0.285557 0.288946 0.240261 0.331662 -0.076990 -0.037407 0.275130 0.232263
polarizability: 2.40004839e+02 -2.26566438e+00 1.74170210e+02 6.09672427e+00 -5.23688217e-01 1.20549962e+02
1716.lowfreq: -3.7885 -0.0003 0.0005 0.0009 2.2192 8.2964 37.2736 42.5051 47.0841
frequency: 37.2366 42.4977 47.0027 60.6862 79.6890 101.9293 124.0826 147.6031 152.4626 171.5009 178.0974 187.2480 218.8223 228.5468 246.3783 253.2241 264.0723 270.7496 291.8412 323.6565 329.9666 341.3267 356.2556 368.2082 380.0425 394.1591 413.6142 419.9160 444.1390 454.8393 493.3393 517.4088 538.2829 550.5365 622.2374 634.2934 635.5609 656.2124 675.0665 712.1945 735.8906 758.0663 800.5775 816.4353 836.8202 866.7130 881.5107 897.9467 906.8707 922.6041 929.5600 968.2233 984.1042 1042.2509 1046.5214 1062.2776 1096.5680 1103.0160 1103.6085 1110.0423 1122.1830 1134.7164 1144.3539 1168.9911 1188.3414 1207.0691 1208.4730 1216.8669 1217.6032 1243.7364 1249.1270 1262.4970 1298.4175 1376.5225 1410.8386 1415.9472 1417.5077 1421.2401 1423.4538 1438.3870 1446.6958 1450.5537 1452.3487 1455.2124 1455.8564 1460.7010 1461.4929 1465.7045 1473.2022 1476.4307 1479.9450 1480.4678 1489.6428 1493.0991 1495.3560 1499.5672 1506.7537 1511.6242 1579.0497 1614.3255 1805.8401 3013.5977 3029.3344 3029.7876 3033.1849 3034.5348 3035.5075 3038.6062 3109.4918 3140.2856 3145.3274 3146.3983 3146.6723 3149.2850 3151.6883 3152.8975 3152.9989 3154.8747 3161.5433 3163.7649 3169.7187 3178.5743 3186.9202 3199.3829 3213.4786 3556.0616
redmass: 3.7797 4.7276 3.3032 3.5752 3.2453 1.0588 4.0430 2.6103 2.9376 1.4989 1.9983 1.1538 3.8765 3.1951 1.0986 1.4013 1.9560 3.3241 3.0435 3.1599 1.4507 1.9331 1.1326 2.6418 2.8909 2.9323 3.2793 2.7815 3.5276 3.1987 3.2358 4.3108 3.4317 3.3820 5.5829 1.1784 4.4758 6.1373 7.7551 5.6276 3.6260 4.4152 3.4644 4.4502 1.5486 1.7650 4.3959 3.0235 2.3085 2.9584 2.7287 1.3776 4.6903 1.1902 1.1891 2.9620 1.3367 1.2987 1.5396 1.2937 1.2902 2.1091 1.8820 2.2102 1.4410 1.7686 1.7955 1.7178 1.7840 2.0459 2.0517 2.6106 1.4052 5.5381 1.8295 1.1464 1.1517 1.1345 1.5508 1.1997 1.0467 1.2374 1.0526 1.1483 1.2017 1.0439 1.1435 1.0626 1.0445 1.0405 1.0477 1.0552 1.0481 1.5168 1.0865 1.0692 1.1973 1.2686 7.8813 6.2210 10.6732 1.0341 1.0321 1.0324 1.0318 1.0325 1.0329 1.0335 1.1042 1.1022 1.1052 1.1052 1.1060 1.1064 1.1063 1.1066 1.1059 1.1061 1.0972 1.1055 1.1003 1.1048 1.1037 1.0957 1.0898 1.0778
irintensity: 4.1223 6.2361 2.1432 0.8052 0.6660 0.0250 2.1453 2.1273 1.2101 0.9530 1.6713 0.0281 3.0391 2.8776 0.4636 0.1342 0.1617 1.5571 12.3062 10.5561 3.4558 3.4415 0.9314 0.9394 0.8525 20.6895 5.1333 2.4195 8.4329 3.1914 26.8490 16.5237 11.9929 10.8655 9.1173 110.3202 9.4494 9.6258 42.3527 3.7748 5.6824 198.4793 3.1991 177.4017 35.5458 0.0664 22.3660 0.2479 53.0808 31.4734 14.3798 0.1502 139.6381 0.0828 0.0442 76.2852 1.7833 0.2825 28.8513 0.8755 0.0486 3.4138 187.3578 130.2708 1.4888 0.0561 0.1920 6.6483 3.5404 5.3740 49.2881 64.5398 7.2428 3.3569 12.8841 21.3249 21.4249 22.3069 9.2513 54.5190 0.6577 105.7413 1.0757 9.6830 44.0623 2.0544 27.1553 12.7515 0.5026 22.9689 9.1763 65.5922 27.4767 238.4712 86.7325 40.4163 60.4205 28.2569 3.5483 4.1004 319.2611 12.9833 3.0395 2.3267 0.8722 4.7437 0.1541 4.8287 7.4403 0.9498 0.3086 0.5165 0.3459 0.0969 2.3832 3.3773 4.6737 5.6001 2.9800 0.6223 1.2617 2.2768 3.1242 5.0031 0.3168 71.6302
temp: 298.150 k
press: 1.00000 atm
elementType: 8 8 7 7 7 6 6 6 6 6 6 6 6 6 6 6 6 6 6 1 1 1 1 1 1 1 1 1 1 1 1 1 1 1 1 1 1 1 1 1 1 1 1 1
symmnumber: 1
zpe: 1003957.5 jmol-1
zpe.correction: 0.382387 hartree
zpe.thermalcorrener: 0.403831 hartree
zpe.thermalcorrenthalpy: 0.404775 hartree
zpe.thermalcorrgfe: 0.333118 hartree
zpe.sumelectzpe: -861.106577 hartree
zpe.sumelectthermal: -861.085133 hartree
zpe.sumelectthermalent: -861.084189 hartree
zpe.sumelectthermalfe: -861.155846 hartree
dipole: 7.6016 4.8616 -1.5966
dipole: 9.1635
quadrupole: 14.5720 -59.9064 -102.1805
quadrupole: -13.2082 7.6824 5.3814
quadrupole: 63.7437 -10.7348 -53.0089 -13.2082 7.6824 5.3814
hfenergy: -861.4889647 hartree
pointgroup: C01 [X(C14H25N3O2)]
dipole: -2.9172128 1.9768573 0.7610856 debye
polarizability: 240.3384378|0.4205367|174.0525095|2.5179049|1.5608022|120.3340638 unknown
InChI: InChI=1S/C14H25N3O2/c1-15-14(18)19-13-9-8-11(16(2,3)4)10-12(13)17(5,6)7/h8-10,15H,1-7H3
charge 2 multiplicity 1
44 atoms
O  2.138911 -0.04082 0.24958
O  2.568437 -1.888859 -1.248402
N  0.566245 2.344744 -0.110264
N  -3.57532 -0.650687 -0.022212
N  4.256029 -0.979162 0.143306
C  -0.069926 0.962469 0.003078
C  -2.062069 -0.45638 0.045132
C  -1.476447 0.822379 -0.044258
C  -0.458419 3.470295 -0.281306
C  1.496936 2.392942 -1.344266
C  1.369633 2.658233 1.172294
C  -4.070888 -1.322815 1.275223
C  -3.924594 -1.547672 -1.229022
C  -4.346208 0.661453 -0.184116
C  0.759339 -0.190155 0.155806
C  -1.250676 -1.601612 0.199099
C  0.142768 -1.463847 0.256183
C  3.026881 -1.125515 -0.388397
C  5.406699 -1.807244 -0.286997
H  -2.102788 1.706339 -0.154779
H  -1.028625 3.321989 -1.210216
H  -1.120457 3.514105 0.596081
H  0.098056 4.416417 -0.353025
H  1.930354 3.402682 -1.407608
H  2.289755 1.646451 -1.221524
H  0.898942 2.176323 -2.241818
H  0.676595 2.656234 2.026871
H  2.142072 1.891195 1.302146
H  1.828749 3.651825 1.056185
H  -3.816139 -0.676993 2.128394
H  -5.161511 -1.454905 1.206547
H  -3.589188 -2.302818 1.391517
H  -3.43781 -2.525543 -1.115498
H  -5.01685 -1.679486 -1.261819
H  -3.568966 -1.059185 -2.148175
H  -4.055612 1.150529 -1.125575
H  -5.419136 0.422007 -0.222852
H  -4.156399 1.313687 0.681094
H  -1.669668 -2.608903 0.280321
H  0.765208 -2.352801 0.373035
H  4.389714 -0.295103 0.891029
H  6.213207 -1.164267 -0.676516
H  5.078036 -2.492154 -1.082669
H  5.78743 -2.399071 0.561891
