program: Gaussian 09
title: 000116406
version: EM64L-G09RevD.01
frameworkgroup: C1[X(C14H19N3OS)]
method: RPBEPBE
basis: SDD
operation: Freq
keyword: #p
keyword: freq=noraman
keyword: PBEPBE/SDD
title: #p freq=noraman PBEPBE/SDD
converged: YES YES NO NO
title: Mulliken charges:
elementType: S O N N N C C C C C C C C C C C C C C H H H H H H H H H H H H H H H H H H H
charge: 0.300805 -0.417157 -0.258925 -0.063262 0.005709 -0.340294 -0.339747 -0.390133 -0.386240 -0.488448 0.354225 -0.612211 -0.044083 -0.406229 0.370165 -0.247466 -0.381281 -0.789113 -0.345196 0.238927 0.222098 0.216602 0.221534 0.221015 0.200862 0.194210 0.219407 0.244471 0.226945 0.225452 0.194416 0.226651 0.261323 0.262168 0.213244 0.244124 0.239129 0.406301
chargesum: 0.00000
title: Mulliken charges with hydrogens summed into heavy atoms:
elementType: S O N N N C C C C C C C C C C C C C C
charge: 0.300805 -0.010855 -0.258925 -0.063262 0.005709 0.120731 0.098390 0.031744 0.027377 -0.017033 0.354225 0.034308 -0.044083 -0.144906 0.370165 -0.247466 -0.119113 -0.092615 -0.345196
polarizability: 2.63608474e+02 -1.42681230e+01 1.76864192e+02 2.70009745e+00 4.62472986e+00 1.44184094e+02
1716.lowfreq: -4.7128 -3.4501 -0.0021 -0.0018 -0.0009 6.5474 17.2533 30.2608 49.1377
frequency: 17.2430 30.2190 49.1000 62.6461 70.9928 85.6064 120.7075 149.6211 169.2694 177.8950 219.3400 223.8794 230.6127 245.9928 263.7828 286.7911 322.3008 331.1241 340.4233 356.1253 367.0236 374.6721 436.2260 451.0671 453.9813 480.7149 494.2321 502.5898 540.7160 571.6384 609.9197 614.3986 643.8904 713.9212 745.8786 751.5547 794.4423 847.2991 851.0519 882.8947 892.4644 912.4935 960.8201 984.6451 999.1043 1018.8628 1025.5294 1046.3049 1047.1217 1072.8165 1086.3197 1097.4067 1105.5977 1122.2575 1134.3000 1150.4275 1181.2478 1193.8384 1216.5833 1227.0437 1230.2735 1259.9839 1278.3699 1285.1974 1296.1196 1310.0866 1325.1213 1345.9513 1358.5965 1366.4875 1372.6402 1381.0130 1399.8363 1415.0839 1433.1537 1441.7070 1451.6801 1452.4024 1457.4699 1460.7812 1463.1664 1464.3492 1476.6275 1478.6175 1481.8585 1517.1288 1593.4314 1616.9240 2098.7974 2238.6262 2846.8306 2854.6242 2873.5022 2939.6657 2946.7882 2952.3235 2984.3040 3006.3307 3024.8214 3036.4897 3040.9099 3047.4332 3061.2646 3062.2328 3081.9733 3094.9975 3136.3386 3147.6832
redmass: 10.4762 5.0897 3.8633 3.5702 4.5722 1.0754 4.0421 4.6649 5.3248 7.2109 1.2173 2.8395 2.7036 3.2196 2.1686 2.0198 3.3582 6.5782 6.0560 2.5531 2.2983 12.5561 3.4316 7.0801 3.6981 3.2029 3.5331 3.4524 4.4111 4.5793 2.7583 8.1216 4.4083 5.1598 4.2075 3.9047 3.0030 1.6950 4.7048 1.4355 1.3556 2.1135 2.6068 1.8575 2.3895 2.3852 2.4232 1.5328 1.5898 1.6381 1.6608 2.0386 2.0456 2.6206 1.7685 2.3510 1.1872 1.4139 1.4519 3.2559 1.3608 1.5922 2.2539 1.5062 1.5884 1.3180 1.4415 1.2970 2.3133 1.5408 1.8702 1.4711 1.3021 3.0003 1.1792 2.0803 1.0582 1.1945 1.0783 1.0989 1.1075 1.1111 1.1111 1.2338 1.0533 1.7130 5.8934 2.7999 12.7518 1.0724 1.0711 1.0678 1.0582 1.0640 1.0631 1.0649 1.0365 1.1004 1.0742 1.0880 1.0904 1.0954 1.0955 1.0966 1.1011 1.1004 1.0926 1.0926
irintensity: 2.2754 0.3425 0.2735 1.2673 2.3179 0.1956 9.1642 4.8894 2.2995 2.1010 0.3278 0.3711 2.7366 0.4275 0.8136 0.6821 0.6507 2.8372 1.6519 1.2979 27.2587 0.2713 16.3887 6.7937 30.1357 2.2306 1.5036 2.9541 7.8304 9.3585 1.8893 5.0746 9.3637 6.7020 8.1842 9.0081 58.3922 0.4518 5.6003 19.8309 14.2841 15.4386 3.2536 13.6975 50.4844 21.7650 1.5356 2.6575 12.6551 5.5837 7.8575 38.9820 12.8616 23.6114 6.9157 25.5916 31.4100 0.4191 14.7445 111.2458 10.1737 12.5766 21.8976 14.7062 43.5758 8.9839 9.3099 6.7354 41.4683 1.5812 14.6987 1.3035 22.1166 32.0148 3.8438 81.9434 13.0951 19.3510 2.2580 9.6277 90.9734 7.7846 24.1714 55.9260 9.8863 141.6742 42.2837 104.6407 25.3877 1835.6949 51.0052 57.5236 169.1808 7.4275 38.5137 67.8159 25.7884 13.0313 45.4243 41.0100 36.6992 26.7703 20.6152 15.2873 30.6234 18.5033 3.1450 2.5289
temp: 298.150 k
press: 1.00000 atm
elementType: 16 8 7 7 7 6 6 6 6 6 6 6 6 6 6 6 6 6 6 1 1 1 1 1 1 1 1 1 1 1 1 1 1 1 1 1 1 1
symmnumber: 1
zpe: 808956.5 jmol-1
zpe.correction: 0.308115 hartree
zpe.thermalcorrener: 0.327298 hartree
zpe.thermalcorrenthalpy: 0.328243 hartree
zpe.thermalcorrgfe: 0.259106 hartree
zpe.sumelectzpe: -1180.956242 hartree
zpe.sumelectthermal: -1180.937059 hartree
zpe.sumelectthermalent: -1180.936115 hartree
zpe.sumelectthermalfe: -1181.005251 hartree
dipole: -7.9458 -0.0711 1.7017
dipole: 8.1263
quadrupole: -140.4933 -120.7431 -122.3659
quadrupole: 11.9691 12.3787 1.5660
quadrupole: -12.6259 7.1244 5.5015 11.9691 12.3787 1.5660
hfenergy: -1181.2643574 hartree
pointgroup: C01 [X(C14H19N3O1S1)]
dipole: 3.1314317 0.057366 -0.6422365 debye
polarizability: 262.6034147|16.9661127|177.6719661|3.655457|-4.8812169|144.381379 unknown
InChI: InChI=1S/C14H19N3OS/c1-11-7-13(19-10-15)8-12(14(11)18)9-17-5-3-16(2)4-6-17/h7-8,18H,3-6,9H2,1-2H3
charge 0 multiplicity 1
38 atoms
S  -4.474855 -0.903185 -1.248285
O  0.627456 1.639247 0.784551
N  1.858325 -0.569139 0.413478
N  4.613751 -0.411066 -0.47383
N  -5.933759 -1.655396 1.208248
C  2.211564 -0.596347 -1.04222
C  2.970145 -1.138443 1.23292
C  3.518625 0.17317 -1.282584
C  4.274898 -0.371051 0.966373
C  0.538136 -1.235161 0.69252
C  -0.630057 -0.376976 0.224873
C  5.925298 0.200318 -0.765609
C  -0.547618 1.046936 0.353991
C  -1.821443 -0.961407 -0.251331
C  -1.663137 1.880787 0.041893
C  -2.922257 -0.137478 -0.558946
C  -2.850453 1.266184 -0.412764
C  -1.543079 3.379118 0.209597
C  -5.316916 -1.334271 0.230893
H  1.384659 -0.134344 -1.60972
H  2.333245 -1.647892 -1.382319
H  3.11761 -2.213495 0.987948
H  2.695519 -1.053465 2.300264
H  3.787123 0.100883 -2.352434
H  3.355804 1.256349 -1.0452
H  4.161428 0.680692 1.338227
H  5.093686 -0.843469 1.539611
H  0.481208 -1.363379 1.792474
H  0.494861 -2.247884 0.237225
H  6.71287 -0.318083 -0.190264
H  5.972085 1.289724 -0.514994
H  6.15678 0.085434 -1.839383
H  -1.895434 -2.048855 -0.364427
H  -3.72058 1.885585 -0.654629
H  -2.467611 3.894119 -0.101276
H  -1.32986 3.641148 1.262331
H  -0.696509 3.774689 -0.380892
H  1.368091 0.858905 0.749088
