program: Gaussian 09
title: 000116260
version: EM64L-G09RevD.01
frameworkgroup: C1[X(C18H30N2O2)]
method: RPBEPBE
basis: SDD
operation: Freq
keyword: #p
keyword: freq=noraman
keyword: PBEPBE/SDD
title: #p freq=noraman PBEPBE/SDD
converged: YES YES NO NO
title: Mulliken charges:
elementType: O O N N C C C C C C C C C C C C C C C C C C H H H H H H H H H H H H H H H H H H H H H H H H H H H H H H
charge: -0.189973 -0.189968 -0.100337 -0.100334 -0.322537 -0.320980 -0.322548 -0.320983 -0.540569 -0.540562 -0.575488 -0.575493 -0.341489 -0.346681 -0.341487 -0.346684 0.447792 0.447777 -0.372802 -0.375544 -0.375546 -0.372798 0.262725 0.276650 0.282111 0.270837 0.262730 0.276655 0.282119 0.270834 0.288823 0.293055 0.288820 0.293057 0.281411 0.270996 0.266968 0.281410 0.270998 0.266968 0.283606 0.222104 0.226576 0.292218 0.283609 0.222101 0.226572 0.292219 0.259631 0.260898 0.260899 0.259634
chargesum: 2.00000
title: Mulliken charges with hydrogens summed into heavy atoms:
elementType: O O N N C C C C C C C C C C C C C C C C C C
charge: -0.189973 -0.189968 -0.100337 -0.100334 0.216838 0.231968 0.216837 0.231970 0.041309 0.041315 0.243887 0.243883 0.164222 0.172113 0.164223 0.172108 0.447792 0.447777 -0.113172 -0.114646 -0.114647 -0.113164
polarizability: 2.84470728e+02 -1.02707093e-04 1.55715486e+02 6.15222581e+00 -1.84103135e-03 1.82306024e+02
1716.lowfreq: -0.0007 0.0006 0.0009 1.7502 5.1577 21.4866 25.3374 33.8662 36.1312
frequency: 25.2604 33.6439 36.1311 64.9401 65.9782 88.3430 147.0837 148.3614 157.1069 202.0336 206.0831 210.4724 225.1411 260.2553 279.7492 285.8450 293.4402 315.9461 344.0813 348.6197 368.2900 380.7584 398.3797 405.2213 406.0165 428.6269 429.2736 456.2110 480.5031 481.0774 496.2074 502.8664 585.9515 611.1970 635.3426 637.5310 676.6803 685.7523 724.4474 773.4711 785.4024 801.2952 805.3958 815.2065 822.0348 844.0926 854.2886 859.1456 863.6324 873.9508 885.1566 919.3813 930.9965 964.7497 979.0460 979.2807 988.4420 997.0218 999.4612 999.8218 999.9077 1013.2454 1019.0027 1019.2081 1039.7363 1039.7669 1083.3091 1083.6513 1113.2387 1123.2063 1143.7266 1154.5501 1155.2485 1174.3132 1174.3597 1205.7494 1206.3115 1207.6655 1215.2138 1220.7786 1231.4367 1232.7903 1266.2181 1266.7784 1276.5028 1276.5373 1307.6299 1310.8730 1325.5537 1326.8494 1335.7106 1345.1517 1347.8185 1354.8192 1358.1805 1375.3561 1376.4624 1385.2509 1394.4430 1396.0556 1414.3692 1432.6371 1432.7980 1439.8701 1440.0011 1451.1686 1451.3594 1460.8692 1460.9541 1467.4537 1467.9898 1475.4007 1475.6366 1486.8711 1487.6460 1492.4674 1492.8897 1505.7973 1576.7327 1619.6186 2978.4772 2978.5274 2982.4624 2982.4792 3025.4191 3025.6659 3029.8077 3029.8456 3031.3111 3031.3338 3034.7145 3034.7834 3095.9520 3096.0435 3097.2963 3097.3070 3099.5656 3099.5742 3108.1601 3108.1695 3111.8721 3111.8877 3131.2500 3132.4945 3144.6595 3144.6781 3149.0842 3154.2622 3161.5418 3161.5981
redmass: 4.5934 3.7604 3.3422 4.1022 3.9326 4.2390 3.6863 4.1227 5.1045 2.4917 1.4137 1.5913 3.1480 2.5001 1.4493 1.8005 3.1908 4.0941 2.9000 3.0409 2.0290 2.1399 2.0283 2.6374 2.1029 1.9144 1.9011 3.7694 2.9810 3.1005 3.2259 3.4113 3.3131 2.3129 3.4214 3.4667 3.3088 3.0794 3.5676 2.7876 2.6190 2.4384 3.8145 2.7098 2.3331 3.6471 2.9833 1.2462 2.2502 2.3034 2.5258 2.2730 2.3849 2.0255 2.0502 1.4714 1.4132 2.3033 2.2602 2.4179 2.5347 2.9543 1.9862 1.9667 1.8010 1.8038 4.6962 4.7985 1.7451 1.8063 1.4518 1.4504 1.4272 1.8341 1.8372 1.2769 1.1638 1.2991 2.4906 2.0717 1.2125 1.1698 1.2599 1.2574 1.1836 1.1809 1.3895 1.4801 1.1976 1.2112 1.2300 1.2345 1.1990 1.3480 1.2954 1.3030 1.2508 3.1590 1.4339 1.3202 2.1729 1.1467 1.1556 1.0917 1.0904 1.0955 1.1014 1.0692 1.0686 1.0862 1.0769 1.0953 1.0890 1.0603 1.0594 1.0744 1.0589 2.3600 6.1555 6.2539 1.0691 1.0691 1.0690 1.0690 1.0597 1.0597 1.0580 1.0579 1.0517 1.0520 1.0411 1.0414 1.1070 1.1069 1.0953 1.0953 1.0975 1.0975 1.1074 1.1074 1.1084 1.1084 1.0886 1.0891 1.1047 1.1047 1.0969 1.0983 1.1031 1.1031
irintensity: 0.8340 2.2699 0.8617 0.4180 0.1566 0.3164 11.9785 7.1406 2.2667 0.0596 0.9585 0.2524 2.3104 0.0038 0.9664 0.6981 0.0891 1.4221 4.0584 10.1082 3.2208 0.0544 2.0411 0.6684 0.3909 0.8672 0.1857 0.6094 2.4360 1.9746 15.6918 11.3099 4.6977 7.0182 5.5723 4.6525 4.1513 3.9459 2.0484 17.1860 4.4010 13.1380 6.2903 43.3398 3.6195 218.5730 24.4225 0.1288 3.0423 26.2026 4.7511 1.2445 3.1121 6.5323 7.0099 0.8392 0.2839 21.6259 0.0415 12.3810 0.7895 2.4975 7.5589 5.1445 22.4749 9.9226 52.8678 16.2603 1.6456 3.0468 7.8895 0.4199 3.0262 0.0015 0.1360 10.7354 17.3058 0.0026 0.1112 26.5467 14.6121 0.4315 6.0254 7.8435 0.2984 1.0402 1.6231 10.5459 12.2195 1.2699 1.1613 13.6087 2.4039 1.8869 1.1566 0.1512 0.3600 11.9523 47.1157 0.3774 10.9501 16.3923 24.1194 16.2848 3.0797 8.3943 8.8324 34.0733 4.0835 21.2158 20.4001 2.8777 8.8451 59.8529 83.4886 15.4823 24.9031 0.2981 0.0054 0.1779 11.8044 29.2647 33.5346 48.3341 6.8046 0.3335 13.3538 1.1232 9.8513 2.2359 7.1886 0.4868 0.0393 0.7038 2.7857 3.4131 2.2352 2.7186 1.8365 2.6920 6.5308 8.2770 0.0091 13.1759 1.8271 4.0315 5.1625 0.0697 4.8402 1.0625
temp: 298.150 k
press: 1.00000 atm
elementType: 8 8 7 7 6 6 6 6 6 6 6 6 6 6 6 6 6 6 6 6 6 6 1 1 1 1 1 1 1 1 1 1 1 1 1 1 1 1 1 1 1 1 1 1 1 1 1 1 1 1 1 1
symmnumber: 1
zpe: 1214541.5 jmol-1
zpe.correction: 0.462594 hartree
zpe.thermalcorrener: 0.483726 hartree
zpe.thermalcorrenthalpy: 0.484671 hartree
zpe.thermalcorrgfe: 0.412594 hartree
zpe.sumelectzpe: -961.536315 hartree
zpe.sumelectthermal: -961.515183 hartree
zpe.sumelectthermalent: -961.514238 hartree
zpe.sumelectthermalfe: -961.586315 hartree
dipole: 0.0002 -1.0628 0.0004
dipole: 1.0628
quadrupole: 25.3666 -112.8818 -106.9383
quadrupole: -0.0009 29.3503 -0.0002
quadrupole: 90.1844 -48.0639 -42.1205 -0.0009 29.3503 -0.0002
hfenergy: -961.9989091 hartree
pointgroup: C01 [X(C18H30N2O2)]
dipole: -0.0002498 0.4181493 -0.000035 debye
polarizability: 284.4114358|0.0479446|155.7155106|-6.625875|0.0113595|182.3652916 unknown
InChI: InChI=1S/C18H30N2O2/c1-19(7-11-21-12-8-19)15-17-3-5-18(6-4-17)16-20(2)9-13-22-14-10-20/h3-6H,7-16H2,1-2H3
charge 2 multiplicity 1
52 atoms
O  -6.1215 -1.291641 -0.898768
O  6.122673 -1.285891 0.899905
N  -3.808032 0.025465 0.398655
N  3.808044 0.028122 -0.398571
C  -3.709596 -0.778097 -0.921953
C  -5.280441 0.502316 0.571104
C  3.710407 -0.773998 0.922975
C  5.280069 0.505899 -0.571741
C  -2.923388 1.313852 0.314235
C  2.922389 1.315888 -0.31559
C  -3.380473 -0.82317 1.589615
C  3.381039 -0.822236 -1.588506
C  -4.784691 -1.875664 -1.009367
C  -6.288079 -0.647214 0.406454
C  4.786291 -1.870722 1.011403
C  6.288559 -0.642735 -0.40603
C  -1.425214 1.111943 0.152645
C  1.424374 1.112952 -0.15378
C  -0.83242 1.102799 -1.138258
C  0.570257 1.104691 -1.288706
C  -0.571091 1.10556 1.28758
C  0.831588 1.104674 1.137132
H  -2.689615 -1.191511 -0.988498
H  -3.870202 -0.049868 -1.735424
H  -5.452418 1.256576 -0.215588
H  -5.36081 0.980491 1.562774
H  2.690733 -1.188061 0.990181
H  3.870648 -0.044733 1.73559
H  5.451595 1.261133 0.214114
H  5.359933 0.983052 -1.563943
H  -3.144431 1.870563 1.241692
H  -3.331401 1.886983 -0.535619
H  3.142988 1.87173 -1.243673
H  3.329932 1.890323 0.533613
H  -4.035123 -1.700341 1.675673
H  -2.341136 -1.150453 1.44353
H  -3.460991 -0.217967 2.505959
H  4.036398 -1.698967 -1.673645
H  2.341989 -1.150205 -1.441931
H  3.460963 -0.218021 -2.505554
H  -4.737929 -2.337937 -2.008271
H  -4.637149 -2.674924 -0.253392
H  -6.223826 -1.392281 1.226164
H  -7.305898 -0.225919 0.409364
H  4.740046 -2.33193 2.010822
H  4.639137 -2.670895 0.256319
H  6.224684 -1.388704 -1.224945
H  7.306077 -0.22072 -0.409567
H  -1.460736 1.158232 -2.034793
H  0.994024 1.161157 -2.298078
H  -0.994906 1.162736 2.296892
H  1.459862 1.161569 2.033605
