program: Gaussian 09
title: 000116039
version: EM64L-G09RevD.01
frameworkgroup: C1[X(C16H19N)]
method: RPBEPBE
basis: SDD
operation: Freq
keyword: #pfreq=noraman
keyword: PBEPBE/SDD
title: #p freq=noraman PBEPBE/SDD
converged: YES YES NO NO
title: Mulliken charges:
elementType: N C C C C C C C C C C C C C C C C H H H H H H H H H H H H H H H H H H H
charge: -0.431366 -0.457895 -0.544383 -0.331082 0.499082 0.459087 -0.410006 -0.415481 -0.365438 -0.432046 0.446060 -0.428421 -0.338225 -0.229077 -0.227660 -0.242642 -0.815037 0.223418 0.224230 0.207086 0.206844 0.207770 0.207587 0.292965 0.231963 0.232078 0.234296 0.210052 0.220361 0.221270 0.224338 0.224420 0.228072 0.223836 0.220276 0.223672
chargesum: 0.00000
title: Mulliken charges with hydrogens summed into heavy atoms:
elementType: N C C C C C C C C C C C C C C C C
charge: -0.138402 -0.010247 -0.130453 0.084275 0.499082 0.459087 -0.178043 -0.183404 -0.131142 -0.221994 0.446060 -0.208060 -0.116955 -0.004739 -0.003240 -0.014570 -0.147254
polarizability: 2.71451125e+02 -1.79516774e+01 1.40720230e+02 1.50795510e+00 4.60018193e-01 1.29924694e+02
1716.lowfreq: -18.8219 -5.9735 -0.0005 0.0003 0.0007 2.2655 12.8064 17.7212 36.8529
frequency: 12.5702 17.5505 35.3519 38.3320 43.6340 81.8934 91.7654 111.1007 156.7259 195.0416 225.4169 281.2392 321.2642 326.4194 332.1297 344.1484 403.4307 411.1394 446.0329 507.2100 508.0893 535.7647 589.6998 617.8761 638.7796 705.6058 710.5649 750.0719 754.9147 764.3816 808.8344 809.5426 811.6067 837.1314 852.3610 864.1073 917.5278 924.7117 949.9887 975.8480 983.0355 989.8470 993.8894 1000.8398 1025.2084 1034.9540 1043.0732 1044.8602 1060.2187 1101.8216 1110.3770 1135.7530 1171.1642 1172.9864 1186.7407 1191.9574 1215.7877 1224.7355 1246.1837 1261.3668 1279.9844 1289.4148 1315.8707 1327.0816 1332.7545 1359.0682 1373.5702 1382.3815 1397.5422 1419.1593 1440.3751 1465.2394 1468.6040 1471.1196 1481.0775 1483.9862 1486.4914 1502.2222 1528.4615 1584.5069 1593.2715 1614.8299 1639.8429 2912.8366 2947.0546 2966.5823 2971.6378 2981.8666 3020.0652 3040.5882 3049.1750 3074.1098 3101.2027 3113.5847 3114.1605 3115.7710 3127.6586 3130.9640 3142.9268 3154.2873 3161.7315 3572.0846
redmass: 3.6113 4.0734 2.4248 4.1995 1.2071 2.0495 4.9541 2.5583 3.7380 5.0653 3.9058 1.0826 3.9115 2.9915 2.4197 3.5362 2.8167 2.9469 4.1179 3.2615 2.3682 4.9637 4.1329 6.3582 6.7950 1.7394 2.7648 3.2033 1.1054 2.3607 1.6816 3.6801 1.2887 5.4369 1.2469 1.2631 1.4482 1.3085 1.3553 1.3877 1.4764 6.2882 1.3152 2.6429 2.4491 3.5731 1.5376 1.5056 3.0470 1.4180 2.4730 1.6102 1.1418 1.1492 1.1160 1.1034 2.2513 2.7220 1.3952 1.2286 1.0906 1.6662 1.4241 1.2561 1.5892 2.1594 2.2789 7.9172 1.2386 3.6480 2.1795 1.3481 1.1064 1.0464 1.1029 2.2634 1.2972 1.1039 3.0940 4.8093 6.0456 6.1922 6.5281 1.0565 1.1032 1.0372 1.0584 1.0589 1.1011 1.0978 1.1050 1.0979 1.0863 1.0876 1.0867 1.0886 1.0963 1.0906 1.0957 1.0940 1.1015 1.0770
irintensity: 0.0473 0.0557 1.8614 0.0793 0.0030 0.4285 0.3045 12.8417 0.4989 0.3025 2.9841 71.9759 8.2403 1.0921 2.2001 0.4972 0.0077 0.0157 2.9742 7.7680 21.8824 4.7796 6.8926 0.0818 0.0593 53.0767 0.9963 28.1988 5.1251 24.5356 65.8840 6.0247 7.0220 2.6841 0.0426 0.4044 2.3634 0.4220 0.0267 0.0098 7.5774 0.1116 0.1179 0.9108 3.9131 7.8460 4.0971 9.4532 0.4075 7.0648 0.1243 24.5078 0.0968 0.6392 0.2408 10.4009 0.1094 0.1951 5.3231 1.2066 0.6361 29.6602 27.0978 0.3267 19.7780 24.0027 41.3935 0.0634 6.9850 6.8724 6.7187 42.3961 0.7250 11.5306 10.5102 23.9477 12.1357 70.0619 292.6028 6.4901 1.4631 13.0001 152.0191 64.1418 37.2454 70.1343 2.0267 62.5950 0.9934 28.3769 55.3492 22.4832 19.5399 8.4584 11.1739 31.2956 32.1439 10.2499 45.0642 18.7540 24.7640 31.5024
temp: 298.150 k
press: 1.00000 atm
elementType: 7 6 6 6 6 6 6 6 6 6 6 6 6 6 6 6 6 1 1 1 1 1 1 1 1 1 1 1 1 1 1 1 1 1 1 1
symmnumber: 1
zpe: 800539.5 jmol-1
zpe.correction: 0.304909 hartree
zpe.thermalcorrener: 0.321797 hartree
zpe.thermalcorrenthalpy: 0.322741 hartree
zpe.thermalcorrgfe: 0.255977 hartree
zpe.sumelectzpe: -674.620916 hartree
zpe.sumelectthermal: -674.604028 hartree
zpe.sumelectthermalent: -674.603084 hartree
zpe.sumelectthermalfe: -674.669849 hartree
dipole: -1.8366 0.3632 -0.0329
dipole: 1.8724
quadrupole: -101.9672 -98.4482 -101.4333
quadrupole: -2.6626 0.2334 0.0252
quadrupole: -1.3510 2.1680 -0.8170 -2.6626 0.2334 0.0252
hfenergy: -674.9258253 hartree
pointgroup: C01 [X(C16H19N1)]
dipole: -0.7216491 0.1479047 -0.0048938 debye
polarizability: 271.2202116|-18.8266818|140.8594064|0.5295269|1.0775879|130.016431 unknown
InChI: InChI=1S/C16H19N/c1-14-9-11-16(12-10-14)17-13-5-8-15-6-3-2-4-7-15/h2-4,6-7,9-12,17H,5,8,13H2,1H3
charge 0 multiplicity 1
36 atoms
N  1.268368 0.528507 0.002248
C  -1.152966 0.036647 -0.00252
C  -2.239922 -1.071749 -0.018032
C  0.274251 -0.544338 -0.009267
C  -3.648637 -0.494877 -0.008189
C  2.649427 0.316442 0.001702
C  -4.293595 -0.176133 1.215117
C  -4.331075 -0.221185 -1.221719
C  3.212204 -0.992582 -0.003603
C  3.544078 1.429656 0.007043
C  5.507965 -0.068459 0.002433
C  4.614391 -1.166272 -0.003037
C  4.936118 1.233508 0.007289
C  -5.582436 0.403248 1.227374
C  -5.620193 0.35834 -1.215528
C  -6.250545 0.673819 0.010451
C  7.015363 -0.262799 0.003512
H  -1.291291 0.693551 -0.884595
H  -1.291979 0.669699 0.896548
H  -2.093249 -1.701465 -0.917288
H  -2.091138 -1.727171 0.862612
H  0.405888 -1.187565 -0.908294
H  0.406503 -1.205561 0.87628
H  0.93012 1.489886 0.000185
H  -3.784299 -0.389486 2.163702
H  -3.850609 -0.46919 -2.176797
H  2.562062 -1.873204 -0.008239
H  3.136113 2.449181 0.010991
H  5.019715 -2.186257 -0.00711
H  5.596668 2.110407 0.011341
H  -6.066658 0.638664 2.182071
H  -6.13362 0.558854 -2.162908
H  -7.251428 1.119851 0.017689
H  7.484813 0.188731 0.898835
H  7.282053 -1.334346 -0.006266
H  7.488339 0.206047 -0.880929
