program: Gaussian 09
title: 000116028
version: EM64L-G09RevD.01
frameworkgroup: C1[X(C13H21NO2S2)]
method: RPBEPBE
basis: SDD
operation: Freq
keyword: #p
keyword: freq=noraman
keyword: PBEPBE/SDD
title: #p freq=noraman PBEPBE/SDD
converged: YES YES NO NO
title: Mulliken charges:
elementType: S S O O N C C C C C C C C C C C C C H H H H H H H H H H H H H H H H H H H H H
charge: 0.814317 0.018031 -0.530483 -0.507469 -0.095243 -0.279596 -0.329635 -0.338532 -0.762678 -0.666917 -0.667633 -0.088100 -0.233015 -0.214297 0.451325 -0.362689 -0.358404 -0.797725 0.224962 0.216461 0.208341 0.197584 0.238688 0.199434 0.291564 0.319902 0.210622 0.226874 0.208739 0.204141 0.226165 0.212398 0.289287 0.277686 0.245377 0.244289 0.230865 0.230880 0.244482
chargesum: 0.00000
title: Mulliken charges with hydrogens summed into heavy atoms:
elementType: S S O O N C C C C C C C C C C C C C
charge: 0.814317 0.018031 -0.530483 -0.507469 -0.095243 0.161828 0.076290 0.099590 -0.151213 -0.020682 -0.024929 -0.088100 0.056273 0.063389 0.451325 -0.117313 -0.114115 -0.091498
polarizability: 4.64103597e+02 1.20190486e+01 1.70811300e+02 -9.83972727e+00 -8.60849894e+00 1.69539476e+02
1716.lowfreq: -10.3248 -7.9042 -0.0022 -0.0021 -0.0007 1.1228 4.9819 11.8502 21.2981
frequency: -8.2362 10.7507 21.1878 25.4013 36.1041 47.4044 64.4515 70.5275 85.5152 113.5656 130.9153 151.5534 170.1836 194.7545 208.2423 220.3658 225.5199 239.8615 262.2541 283.1431 288.6997 302.3865 323.9541 376.5877 381.2202 384.4353 405.3455 426.2341 445.1202 474.2265 504.8075 583.7011 619.8161 682.1087 703.0303 738.8277 748.8883 774.5557 785.5967 793.8975 798.0717 822.0149 842.4859 910.1598 912.1245 959.1080 979.6866 988.7463 989.7992 991.6298 998.9650 1041.6691 1048.9601 1049.4186 1073.9625 1076.5633 1082.6786 1097.3993 1118.9056 1140.0904 1185.1996 1205.6438 1218.7970 1219.7044 1270.3243 1289.5113 1292.7677 1296.3554 1297.0728 1358.5806 1364.4175 1374.0873 1380.7874 1387.7032 1390.8077 1391.3849 1399.4470 1424.4822 1460.2101 1461.9998 1470.4618 1471.1033 1471.7525 1474.5573 1479.4130 1481.3775 1487.9716 1489.4352 1592.5787 1593.7041 2870.1727 2877.7977 2908.6295 2932.6311 2981.4108 2982.5132 2984.2243 3030.7085 3037.2183 3047.0559 3063.0513 3064.1168 3075.5407 3077.3982 3091.8198 3092.2372 3093.8631 3137.2120 3138.7600 3163.7381 3167.0769
redmass: 1.0508 4.4815 4.4563 3.7443 5.1799 5.8672 2.5157 3.2754 2.0049 4.4144 5.9375 1.5629 11.0687 1.8309 2.1088 2.4998 6.4073 2.7204 3.3465 4.4980 2.1982 4.4240 2.8458 3.3316 4.0138 6.6073 2.8633 7.8687 2.8443 2.7290 3.1795 5.9409 6.9577 5.0766 3.2919 1.2798 2.5218 5.4982 6.0576 1.2167 1.2189 1.3501 1.2489 1.9294 16.2404 1.3023 1.3826 2.2903 3.8410 1.5879 1.4807 3.4454 1.7526 2.1441 2.8036 1.8650 2.0907 1.7078 1.2825 1.4750 1.1412 2.0662 2.9980 1.7489 1.1849 1.2406 1.2286 1.2330 1.1833 1.3309 1.3541 1.3088 6.2186 1.2362 1.2314 2.9776 1.2194 1.0709 1.0613 1.0539 1.6509 1.3452 1.0603 1.0695 1.0503 1.0588 1.0732 1.0768 6.5481 6.2906 1.0717 1.0715 1.0703 1.0668 1.0390 1.0358 1.0355 1.0888 1.0884 1.0890 1.0955 1.0946 1.0985 1.0982 1.1005 1.1004 1.1001 1.0892 1.0894 1.0954 1.0966
irintensity: 1.1217 1.8788 1.1431 0.2303 0.8769 1.9010 1.5201 0.4086 0.2071 1.6099 1.9302 8.9400 22.2556 1.1129 0.7736 12.6104 9.4778 21.9688 1.2863 5.8623 2.8105 1.4435 2.7169 7.3101 10.5125 23.6716 0.0753 102.6323 7.3673 7.7680 76.4758 23.2807 0.2632 3.4378 0.3064 32.2255 9.1404 10.7767 46.4461 19.2718 7.9593 42.8532 2.9862 3.0589 57.8170 1.4617 0.2076 5.2652 11.1886 2.7014 2.1121 8.4865 45.3790 10.3491 28.6489 44.9485 2.8507 73.2385 10.4117 27.8741 27.8644 23.5310 12.9607 16.5988 14.2755 75.1919 15.3684 5.5860 5.4715 0.3461 104.3046 31.0389 0.4362 34.0968 23.1711 9.9662 15.7262 10.3573 3.0089 20.4541 27.5787 28.8885 17.5251 14.1925 4.9559 25.3663 7.1744 17.0727 2.3624 3.6407 65.4384 210.8866 65.2573 5.5071 30.6033 44.6744 52.1974 0.8124 21.9149 41.8150 8.7238 18.5277 55.8426 64.8559 23.3514 61.6690 14.8071 13.5954 10.3499 3.6158 13.6492
temp: 298.150 k
press: 1.00000 atm
elementType: 16 16 8 8 7 6 6 6 6 6 6 6 6 6 6 6 6 6 1 1 1 1 1 1 1 1 1 1 1 1 1 1 1 1 1 1 1 1 1
symmnumber: 1
zpe: 829768.1 jmol-1
zpe.correction: 0.316042 hartree
zpe.thermalcorrener: 0.337457 hartree
zpe.thermalcorrenthalpy: 0.338401 hartree
zpe.thermalcorrgfe: 0.261655 hartree
zpe.sumelectzpe: -1507.729229 hartree
zpe.sumelectthermal: -1507.707814 hartree
zpe.sumelectthermalent: -1507.706870 hartree
zpe.sumelectthermalfe: -1507.783616 hartree
dipole: -2.2953 0.2779 -2.9634
dipole: 3.7586
quadrupole: -82.1945 -127.9851 -131.3103
quadrupole: -1.3019 6.2880 -3.3159
quadrupole: 31.6355 -14.1552 -17.4803 -1.3019 6.2880 -3.3159
hfenergy: -1508.0452711 hartree
pointgroup: C01 [X(C13H21N1O2S2)]
dipole: 0.9407457 0.4785726 -1.0356985 debye
polarizability: 462.3443429|8.4713197|163.3522186|25.8508548|5.5855789|178.7578114 unknown
InChI: InChI=1S/C7H7O2S.C6H14NS/c1-6-2-4-7(5-3-6)10(8)9;1-3-7(4-2)5-6-8/h2-5H,1H3;3-6H2,1-2H3
charge 0 multiplicity 1
39 atoms
S  0.577253 -0.148344 1.360109
S  -0.620234 1.961805 0.739445
O  -0.109631 -1.281177 0.383803
O  0.617455 -0.373452 2.975864
N  -4.331565 0.170997 0.093953
C  -3.271145 0.913743 0.80721
C  -5.712363 0.635703 0.378447
C  -4.156464 -1.306092 0.135661
C  -2.026768 1.049458 -0.094347
C  -6.046138 1.979296 -0.299198
C  -4.733057 -2.017081 -1.103683
C  2.352428 0.095882 0.782154
C  3.307252 0.456753 1.745677
C  2.653631 -0.103354 -0.574546
C  5.004474 0.434894 -0.046087
C  4.641386 0.624779 1.313355
C  3.995579 0.068751 -0.977442
C  6.447169 0.587613 -0.490936
H  -2.974324 0.425204 1.764985
H  -3.646356 1.919845 1.06407
H  -6.409369 -0.133366 -0.000705
H  -5.893951 0.712483 1.479261
H  -3.073956 -1.521923 0.199695
H  -4.613192 -1.731739 1.063203
H  -2.254443 1.576547 -1.038394
H  -1.621715 0.04711 -0.353876
H  -5.381434 2.79136 0.048035
H  -5.933627 1.891633 -1.393821
H  -7.086067 2.278868 -0.07094
H  -5.821596 -1.854323 -1.206585
H  -4.244407 -1.641702 -2.019524
H  -4.562407 -3.107357 -1.03312
H  3.019011 0.583023 2.794089
H  1.875152 -0.399461 -1.284317
H  5.408337 0.905835 2.044014
H  4.261157 -0.083262 -2.029872
H  6.515586 0.938794 -1.535076
H  6.996479 1.299986 0.148308
H  6.978759 -0.382125 -0.435071
