program: Gaussian 09
title: 000133472
version: EM64L-G09RevD.01
frameworkgroup: C1[X(C13H13NO7)]
method: RPBEPBE
basis: SDD
operation: Freq
keyword: #p
keyword: freq=noraman
keyword: PBEPBE/SDD
title: #p freq=noraman PBEPBE/SDD
converged: YES YES NO NO
title: Mulliken charges:
elementType: O O O O O O O N C C C C C C C C C C C C C H H H H H H H H H H H H H
charge: -0.287387 -0.256730 -0.411679 -0.450678 -0.241788 -0.249554 -0.201147 -0.465476 0.547431 -0.563572 -0.580871 0.206322 0.228021 -0.469425 -0.336176 0.268135 -0.354372 0.193400 0.130654 0.270019 -0.750109 0.230937 0.282068 0.316346 0.276277 0.298323 0.260010 0.317215 0.257838 0.276640 0.242629 0.247364 0.379531 0.389804
chargesum: 0.00000
title: Mulliken charges with hydrogens summed into heavy atoms:
elementType: O O O O O O O N C C C C C C C C C C C C C
charge: -0.287387 -0.256730 -0.032147 -0.060874 -0.241788 -0.249554 -0.201147 -0.149130 0.547431 -0.050567 -0.304594 0.206322 0.228021 0.088908 -0.018961 0.268135 -0.096534 0.193400 0.130654 0.270019 0.016524
polarizability: 2.88901163e+02 -3.83504156e+00 1.64100202e+02 7.20653924e-01 3.79302418e+00 1.00860942e+02
1716.lowfreq: -11.2167 -2.9768 -0.0005 0.0003 0.0008 2.0963 17.4132 25.0169 36.7163
frequency: 17.4031 24.9925 36.7146 44.2498 54.5801 63.8443 77.1685 95.8170 98.6617 112.2681 115.7633 144.1643 148.4289 167.4389 211.9685 232.1701 274.0125 300.2444 321.7625 358.8829 373.2133 415.3452 425.7585 447.2232 502.6547 507.0868 522.9153 534.3646 547.9251 570.3533 595.9082 600.3283 614.6159 633.9628 649.2953 656.4985 684.4856 700.6013 723.2725 753.3510 773.4369 800.4895 843.7001 869.7616 879.3231 905.3947 917.3329 958.6565 985.4504 996.3989 1000.3421 1015.9406 1037.3651 1051.8780 1095.9191 1111.2351 1146.6095 1149.7068 1157.7143 1187.5159 1201.8172 1240.1240 1257.5514 1265.6681 1276.3547 1323.2701 1331.2389 1367.4376 1378.2257 1382.6169 1404.5134 1442.3014 1450.0422 1453.7649 1454.5031 1487.1966 1510.8083 1584.1946 1616.0540 1627.7468 1646.6809 1662.6646 1697.8450 2985.6347 2999.1305 3009.9594 3039.9592 3074.5567 3104.0211 3143.8855 3153.8143 3168.8177 3198.3678 3514.5216 3524.0640 3534.4539
redmass: 6.8305 8.4229 7.0073 7.1458 7.0276 3.9821 3.6137 4.5385 3.5692 1.8615 1.8145 6.2781 5.4474 7.2734 5.5575 6.0971 6.3009 10.4577 4.3442 7.1132 5.4961 6.4662 3.2054 3.9036 2.9601 3.3689 2.8624 3.2942 2.9117 4.2148 1.9623 2.0783 5.1754 3.4868 1.4859 1.2892 5.3233 4.2291 6.9453 3.9213 3.9726 2.0006 3.9593 1.7512 4.6342 4.8922 1.6255 5.6076 2.2412 1.3678 3.6191 2.1355 1.6434 2.9192 2.4077 2.0446 1.5140 2.2751 1.3222 2.0007 2.5486 1.3433 1.5481 1.3687 1.8613 2.3203 2.0199 3.3096 1.2431 2.3723 6.5714 1.0730 1.0560 1.0980 1.0509 3.2900 2.2569 6.5919 7.0346 4.7012 8.3579 8.0611 10.7362 1.0607 1.0641 1.0367 1.0991 1.0963 1.0959 1.1022 1.0918 1.0909 1.0958 1.0640 1.0765 1.0642
irintensity: 0.2326 1.2898 0.0913 3.0650 0.2091 7.9469 4.0057 1.3075 2.7238 0.8393 0.4702 2.4282 9.7098 1.5339 1.4420 5.4600 0.0553 5.5668 3.2966 3.7238 0.4730 22.3409 10.3617 29.8706 27.9616 35.2175 6.0445 3.8474 16.2985 56.7334 123.9330 59.1206 25.6775 23.9575 129.4431 23.1092 2.8522 21.4335 8.0493 3.8960 9.8495 20.5075 94.8596 59.5288 33.4423 13.0815 29.1263 18.5962 153.6221 9.2327 198.3779 67.5502 10.3834 209.3153 97.3262 127.2752 103.7049 485.5982 69.9791 41.0912 1.8574 42.6196 31.3298 26.2158 5.0452 72.6050 86.2550 207.7849 92.1431 1.3987 3.4423 15.3523 18.3359 51.9904 23.5100 249.4717 423.7710 10.7369 175.4907 116.9163 250.8378 195.5746 168.0717 10.3287 37.8729 1.1402 11.2444 7.9010 6.4111 10.5406 6.4629 2.7534 9.1596 28.3651 14.8331 54.1078
temp: 298.150 k
press: 1.00000 atm
elementType: 8 8 8 8 8 8 8 7 6 6 6 6 6 6 6 6 6 6 6 6 6 1 1 1 1 1 1 1 1 1 1 1 1 1
symmnumber: 1
zpe: 650515.3 jmol-1
zpe.correction: 0.247768 hartree
zpe.thermalcorrener: 0.268714 hartree
zpe.thermalcorrenthalpy: 0.269658 hartree
zpe.thermalcorrgfe: 0.194360 hartree
zpe.sumelectzpe: -1083.007423 hartree
zpe.sumelectthermal: -1082.986477 hartree
zpe.sumelectthermalent: -1082.985533 hartree
zpe.sumelectthermalfe: -1083.060831 hartree
dipole: 1.0247 2.2310 0.0381
dipole: 2.4554
quadrupole: -109.9292 -112.3795 -129.6303
quadrupole: 2.7350 13.4036 4.8633
quadrupole: 7.3838 4.9335 -12.3173 2.7350 13.4036 4.8633
hfenergy: -1083.2551908 hartree
pointgroup: C01 [X(C13H13N1O7)]
dipole: -0.3931189 0.8779855 -0.0882178 debye
polarizability: 288.8125073|1.6895503|162.6710778|-5.7427145|-9.9323344|102.3787222 unknown
InChI: InChI=1S/C13H13NO7/c1-7(15)21-10-3-2-8(6-9(10)13(19)20)14-11(16)4-5-12(17)18/h2-3,6,14,17,19H,4-5H2,1H3
charge 0 multiplicity 1
34 atoms
O  3.905503 -1.116657 0.54018
O  -2.697795 -1.556919 0.585823
O  -7.553599 -0.471253 -0.598214
O  2.637558 2.917806 -0.557132
O  -6.704364 1.178257 0.796456
O  4.468011 1.577597 -0.103457
O  4.399271 -0.988513 -1.753184
N  -1.533375 0.404454 0.032548
C  -0.177866 -0.012554 0.161923
C  -3.988812 0.474515 0.087055
C  0.826473 0.948365 -0.093025
C  2.202701 0.62613 0.005179
C  -2.695759 -0.33518 0.249909
C  -5.170488 -0.4357 -0.286992
C  0.196423 -1.333694 0.533345
C  2.561653 -0.707176 0.358931
C  1.561403 -1.662132 0.622873
C  -6.504249 0.199017 0.04262
C  3.222707 1.684689 -0.212641
C  4.798182 -1.11925 -0.586426
C  6.207238 -1.310594 -0.096031
H  -3.864801 1.284014 -0.657067
H  -4.217404 0.970159 1.051707
H  -1.667019 1.38046 -0.243759
H  0.562587 1.974693 -0.367922
H  -5.081395 -1.383321 0.281355
H  -5.157383 -0.723198 -1.352461
H  -0.578063 -2.075105 0.735811
H  1.870269 -2.674791 0.897682
H  6.557354 -0.342583 0.305552
H  6.858409 -1.61649 -0.92763
H  6.245367 -2.049276 0.720423
H  -8.419541 -0.057106 -0.332885
H  3.3658 3.581539 -0.691149
