program: Gaussian 09
title: 000115611
version: EM64L-G09RevD.01
frameworkgroup: C1[X(C12H25NO3S2)]
method: RPBEPBE
basis: SDD
operation: Freq
keyword: #p
keyword: freq=noraman
keyword: PBEPBE/SDD
title: #p freq=noraman PBEPBE/SDD
converged: YES YES NO NO
title: Mulliken charges:
elementType: S S O O O N C C C C C C C C C C C C H H H H H H H H H H H H H H H H H H H H H H H H H
charge: 0.097929 0.970400 -0.565248 -0.503684 -0.498547 -0.279127 -0.025430 -0.106366 -0.488820 -0.501652 -0.445438 -0.431600 -0.448619 -0.378298 -0.727022 -0.331068 -0.310985 -0.772795 0.223312 0.190678 0.196379 0.230416 0.214819 0.210081 0.217447 0.201747 0.212545 0.210941 0.238306 0.213194 0.208485 0.213799 0.261991 0.219682 0.217247 0.220269 0.205930 0.198335 0.230204 0.229378 0.286745 0.317616 0.376822
chargesum: 0.00000
title: Mulliken charges with hydrogens summed into heavy atoms:
elementType: S S O O O N C C C C C C C C C C C C
charge: 0.097929 0.970400 -0.188426 -0.503684 -0.498547 -0.017137 0.197882 0.084312 -0.062025 -0.076751 -0.026243 -0.008114 0.002881 0.043986 -0.069823 0.073197 0.148597 -0.168434
polarizability: 5.02848280e+02 -2.74582807e+01 1.98305595e+02 1.56178654e+01 -5.64901815e+00 1.56736647e+02
1716.lowfreq: -19.6577 -14.3303 -4.6597 -0.0025 -0.0015 -0.0007 1.6853 10.9250 15.2582
frequency: -17.1334 9.2947 14.2928 29.1295 36.9316 43.8977 66.0238 79.3616 87.3987 106.2447 111.5008 126.3424 138.5203 144.2513 179.3239 184.5960 195.0114 198.6462 209.6638 243.9838 248.9884 264.9641 285.4342 299.5167 301.8690 358.5969 366.1408 399.7943 437.7251 460.9839 516.1130 551.6047 568.5422 593.3693 628.8201 692.9145 726.4603 763.9067 776.5659 801.3325 815.0151 824.9277 835.9157 863.4361 901.4430 931.3110 933.1296 946.3521 965.8081 974.0996 990.6793 1012.8631 1019.6822 1038.8673 1046.3015 1050.5920 1054.4836 1071.8236 1087.8233 1089.5752 1122.3305 1137.3303 1154.6136 1159.1063 1170.7800 1183.3875 1201.2528 1219.2165 1233.9046 1242.7823 1261.2614 1268.0730 1269.9242 1278.4283 1285.9729 1291.3341 1298.2245 1305.3616 1307.2200 1313.8550 1323.1792 1336.9035 1349.9585 1355.9829 1379.0340 1388.1263 1419.4615 1447.7855 1458.4778 1466.3232 1468.0656 1469.0268 1472.6191 1475.3104 1482.1373 1484.4583 1489.6371 1492.3582 2852.2404 2889.5570 2911.2229 2945.6214 2955.8141 2970.2289 2978.8997 2979.5231 2984.5970 2986.7133 2987.9875 2997.6517 3002.5952 3003.7191 3030.9184 3033.3184 3037.0237 3050.7213 3054.2883 3068.3972 3070.9904 3073.0404 3075.0800 3451.5117 3454.2542
redmass: 6.9614 4.8645 7.6939 3.5906 3.9162 2.3345 2.5138 2.7395 2.0774 3.5315 2.7727 3.7339 3.1081 2.8748 1.9523 2.0918 2.1271 2.3984 4.9642 3.6269 2.1272 2.4611 7.5354 4.3423 3.0720 2.7224 4.1482 12.8060 2.6408 3.0059 15.7627 2.4484 2.0012 1.4046 2.5894 5.3491 1.1489 1.3186 1.2460 2.1649 1.2514 13.9844 1.8689 2.4159 2.5066 9.5047 1.7129 1.7893 1.8327 1.7956 1.4504 3.1644 1.6632 1.4816 2.1811 1.2730 2.1478 2.6473 2.5399 2.2580 1.5031 1.5684 3.0124 2.0170 1.5184 1.9259 1.4726 1.2788 1.2893 1.2470 1.2127 1.2464 1.2745 1.1324 1.0756 1.2222 1.2171 1.3663 1.2728 1.3827 1.4479 1.4371 1.3999 1.4680 1.4432 1.2242 1.0822 1.2495 1.0796 1.0767 1.0816 1.0757 1.0854 1.0721 1.0616 1.0659 1.0950 1.0703 1.0704 1.0699 1.0798 1.0641 1.0819 1.0659 1.0553 1.0428 1.0836 1.0621 1.0614 1.0646 1.0719 1.0810 1.0940 1.1002 1.0998 1.0977 1.1016 1.1030 1.0987 1.1043 1.1004 1.0746 1.0662
irintensity: 0.2251 0.0752 1.0721 0.2783 0.4399 0.0796 0.6864 0.2607 5.7084 9.1079 15.1167 6.0861 6.9410 0.4634 61.5002 1.8634 3.8569 11.2471 71.1369 6.7269 5.0118 0.2181 34.7042 22.6608 8.6556 2.7567 16.2211 47.8331 0.8542 61.5209 174.8176 16.2977 13.7821 258.4458 25.1079 5.2207 6.2042 10.8948 17.2742 15.9368 14.8250 110.4224 0.9948 1.2658 4.7854 78.2553 8.8898 26.0329 22.7628 3.3956 3.9106 0.6788 0.9231 0.8434 3.1822 83.4365 0.9186 15.2616 3.9979 10.4210 15.5396 4.1964 83.0509 2.0821 0.1799 5.6369 5.0005 119.7085 2.1474 17.5921 3.0511 7.8220 5.3154 8.8402 1.3093 3.2610 6.1842 0.7563 1.6129 4.2907 20.1924 4.6276 0.5454 0.2936 67.4235 37.4473 19.6572 25.3419 24.9721 3.7697 4.0755 3.2046 20.4763 4.1832 2.4815 6.9120 11.1882 33.4550 41.5470 102.6237 24.1805 3.4716 14.7774 28.3103 36.7721 46.8545 19.7024 54.0663 38.0248 19.3503 35.0608 90.0026 4.3693 31.9914 26.5078 34.1891 32.6079 15.2896 42.4083 110.5214 105.7336 55.4411 49.4306
temp: 298.150 k
press: 1.00000 atm
elementType: 16 16 8 8 8 7 6 6 6 6 6 6 6 6 6 6 6 6 1 1 1 1 1 1 1 1 1 1 1 1 1 1 1 1 1 1 1 1 1 1 1 1 1
symmnumber: 1
zpe: 945117.5 jmol-1
zpe.correction: 0.359976 hartree
zpe.thermalcorrener: 0.382767 hartree
zpe.thermalcorrenthalpy: 0.383711 hartree
zpe.thermalcorrgfe: 0.303156 hartree
zpe.sumelectzpe: -1547.147060 hartree
zpe.sumelectthermal: -1547.124269 hartree
zpe.sumelectthermalent: -1547.123325 hartree
zpe.sumelectthermalfe: -1547.203880 hartree
dipole: -5.6804 0.4690 0.1912
dipole: 5.7030
quadrupole: -158.0150 -127.4444 -123.7449
quadrupole: 3.7632 5.1397 -8.8582
quadrupole: -21.6135 8.9570 12.6565 3.7632 5.1397 -8.8582
hfenergy: -1547.5070362 hartree
pointgroup: C01 [X(C12H25N1O3S2)]
dipole: 2.2358199 -0.1820042 -0.0476691 debye
polarizability: 501.8435064|-17.0821991|188.7171997|-32.284429|18.4245107|167.3298158 unknown
InChI: InChI=1S/C12H24NS.HO3S/c1-2-11(10-13-8-5-9-14)12-6-3-4-7-12;1-4(2)3/h11-13H,2-10H2,1H3;1H
charge 0 multiplicity 1
43 atoms
S  -5.024905 -1.389286 -0.526813
S  -5.682598 0.716087 0.615331
O  -4.968145 0.287725 2.28911
O  -4.7759 1.91429 -0.005561
O  -7.269902 0.957561 0.809769
N  0.213742 -0.44178 -0.075167
C  4.009676 0.307138 -0.11548
C  2.691506 -0.39103 0.317532
C  5.263423 -0.133698 0.689576
C  3.997273 1.866225 0.044987
C  6.293439 0.981438 0.39742
C  5.450598 2.287811 0.451112
C  1.501448 0.098459 -0.549366
C  2.790227 -1.944653 0.335336
C  3.137544 -2.603361 -1.019191
C  -0.973985 -0.17731 -0.896157
C  -2.212952 -0.902903 -0.32795
C  -3.44434 -0.64135 -1.20512
H  4.198186 0.070579 -1.184696
H  2.490445 -0.067402 1.366385
H  5.023333 -0.154777 1.773043
H  5.626072 -1.138828 0.409169
H  3.674547 2.366562 -0.88574
H  3.276011 2.160716 0.832738
H  7.138438 0.988918 1.109194
H  6.715778 0.839581 -0.616788
H  5.85957 3.072915 -0.209741
H  5.455237 2.696572 1.478754
H  1.494696 1.214624 -0.567672
H  1.641547 -0.230445 -1.598338
H  3.546234 -2.242093 1.087677
H  1.818513 -2.344505 0.683148
H  0.055008 -0.293497 0.930153
H  2.376687 -2.379123 -1.789021
H  3.18021 -3.702705 -0.91157
H  4.11902 -2.269407 -1.403409
H  -0.765221 -0.533794 -1.925782
H  -1.203834 0.916098 -0.980423
H  -2.417372 -0.543203 0.699678
H  -2.001564 -1.985732 -0.260216
H  -3.34203 -1.058552 -2.2255
H  -3.633131 0.4491 -1.312387
H  -5.414225 0.88374 2.96217
