program: Gaussian 09
title: 000115841
version: EM64L-G09RevD.01
frameworkgroup: C1[X(C24H17N3O4)]
method: RPBEPBE
basis: SDD
operation: Freq
keyword: #p
keyword: freq=noraman
keyword: PBEPBE/SDD
title: #p freq=noraman PBEPBE/SDD
converged: YES YES NO NO
title: Mulliken charges:
elementType: O O O O N N N C C C C C C C C C C C C C C C C C C C C C C C C H H H H H H H H H H H H H H H H H
charge: -0.240214 -0.184409 -0.253945 -0.198058 -0.080885 -0.036998 -0.457346 0.072158 0.317562 0.291757 0.254126 -0.104791 -0.240065 0.178085 -0.406926 -0.371294 -0.367287 -0.348919 -0.202305 -0.223914 -0.223425 -0.368405 0.205098 0.201005 0.444370 -0.765265 -0.439197 -0.346976 -0.204169 -0.217503 -0.253166 0.296139 0.279895 0.293579 0.288212 0.248945 0.244122 0.245079 0.274608 0.380395 0.246625 0.297862 0.229480 0.264392 0.303994 0.223441 0.226407 0.228123
chargesum: 0.00000
title: Mulliken charges with hydrogens summed into heavy atoms:
elementType: O O O O N N N C C C C C C C C C C C C C C C C C C C C C C C C
charge: -0.240214 -0.184409 -0.253945 -0.198058 -0.080885 -0.036998 -0.076951 0.072158 0.317562 0.291757 0.254126 -0.104791 -0.240065 0.178085 -0.110786 -0.091399 -0.073708 -0.060707 0.046640 0.020208 0.021654 -0.093798 0.205098 0.201005 0.444370 0.008703 -0.174805 -0.042982 0.019272 0.008904 -0.025043
polarizability: 4.48909224e+02 2.39430260e+01 4.03125812e+02 -9.14468844e+00 3.04669645e+01 1.54779382e+02
1716.lowfreq: -3.7254 -0.0006 -0.0002 0.0005 2.4498 5.2967 18.4168 29.6703 37.3412
frequency: 18.3658 29.6588 37.3238 45.6748 48.9687 55.2920 65.1108 73.1385 97.3381 103.0355 113.1654 135.4146 155.5466 165.8743 172.1130 201.3537 222.0185 229.6852 235.2793 264.1989 276.1238 293.5226 309.4926 346.3471 347.3815 367.3955 375.7745 393.6531 401.2479 410.4135 416.1100 427.2274 466.3917 477.4911 487.2058 495.3502 515.7527 549.8101 556.1568 595.2814 599.8538 613.0374 616.5537 646.3700 654.6004 670.7866 688.8203 701.1025 715.8705 743.5659 758.6728 769.0792 771.5952 801.8175 807.1729 815.5105 837.6350 852.3763 861.5105 866.1195 879.7193 911.0470 925.7086 930.1383 933.4086 942.6677 951.4440 983.4582 983.6521 985.8982 995.7036 1000.3088 1007.2117 1015.6769 1020.0748 1028.3552 1032.7330 1035.6989 1070.7431 1086.9647 1090.9190 1164.2077 1168.9090 1171.4359 1175.0274 1178.2020 1186.4982 1194.0928 1194.9060 1212.2663 1229.0385 1252.0994 1263.5478 1279.7604 1299.8327 1308.0155 1325.8624 1371.5233 1384.3690 1390.5996 1404.2376 1428.9320 1432.3451 1436.2086 1436.7333 1444.5946 1446.4432 1449.2596 1468.8306 1486.9530 1505.7232 1542.0881 1542.4301 1570.1768 1578.8437 1597.1699 1603.9862 1611.1441 1615.2447 1619.6854 1631.8456 2928.5305 2984.9119 3069.0412 3126.5371 3127.4249 3136.7060 3140.2242 3147.0879 3148.9690 3153.4777 3162.1245 3163.6511 3164.3480 3173.8622 3174.6864 3199.2286 3362.2128
redmass: 5.8126 6.3760 5.8104 5.4545 4.9654 6.7900 6.6407 7.1279 4.8475 5.1423 5.0314 5.4739 1.6711 7.5321 2.6610 5.3989 5.2864 4.7248 5.9287 5.1574 4.8415 7.7841 7.4640 7.4224 8.1987 7.4583 9.3049 4.4926 6.7239 2.9904 5.2391 3.8919 8.8548 5.4645 3.7352 4.7812 3.1519 5.6043 7.4664 5.6610 4.7146 6.0485 5.7750 6.5059 4.8106 6.3230 5.2613 1.9885 3.1172 2.8236 4.7539 1.6593 6.3275 1.9566 3.2870 1.8256 1.2382 4.7433 2.7193 1.2510 3.4529 6.0720 1.9740 2.2145 1.4440 5.1101 1.5300 2.1058 2.1668 5.1305 1.4067 1.3077 1.3896 1.3716 3.2658 2.2167 2.0396 2.1714 1.9865 2.5353 1.5815 2.1371 2.0702 1.1708 1.2951 1.2824 2.1529 1.6114 1.3836 1.8661 1.9296 1.7021 2.4700 1.7285 3.9247 2.7982 1.4192 1.2575 6.4222 9.2954 9.7672 2.4245 1.9496 1.6528 2.0955 2.9376 1.1359 5.2864 2.7558 2.3530 7.9291 7.7872 2.1574 6.9286 6.7292 7.8051 6.0965 7.1463 5.7768 5.5985 3.8056 1.0792 1.0367 1.0947 1.0850 1.1013 1.0892 1.0864 1.0875 1.0947 1.0900 1.0927 1.0948 1.1003 1.1003 1.0995 1.0948 1.0811
irintensity: 0.1632 0.0232 0.9075 1.3504 0.7558 7.2197 1.8746 3.4826 0.6324 3.5194 0.8930 0.5178 1.0035 0.5710 3.1116 5.0246 0.8916 5.3529 1.1717 6.7362 7.0518 1.3305 0.0959 1.0345 3.8434 4.1919 21.8325 8.0345 1.3449 0.1677 1.5478 2.3656 0.2824 10.5433 6.3305 3.8315 12.1390 4.2331 17.9827 15.0742 2.6474 1.8455 0.9788 2.4759 4.8880 10.5200 51.0234 36.9140 41.5513 23.3602 23.7931 42.1273 1.5886 4.6698 11.2762 62.6747 65.1346 4.2411 18.9088 30.1499 45.2240 5.8169 13.6030 15.7028 22.4377 2.3238 0.6340 11.9198 5.9122 0.4924 4.0747 3.5870 3.6694 0.5627 26.5859 10.3756 19.4305 1.9435 5.8689 1.7468 10.3923 7.1332 35.7240 4.7272 11.7061 8.8476 92.3553 15.6086 30.8681 36.8965 42.9724 3.9210 67.6452 17.2520 528.7685 8.4756 49.7529 123.9909 22.8680 1.2622 8.2781 3.8316 35.4243 74.9262 24.7477 4.5033 26.6920 12.2174 7.4772 107.9408 84.2467 208.7628 207.1881 10.5335 19.5913 3.0350 148.3277 3.5442 7.0392 53.4661 152.2692 23.5042 9.8884 13.4304 1.1559 12.0394 14.9482 2.4076 5.8843 11.0701 3.9234 1.5315 1.8486 33.4308 32.9109 1.6897 5.3431 285.0443
temp: 298.150 k
press: 1.00000 atm
elementType: 8 8 8 8 7 7 7 6 6 6 6 6 6 6 6 6 6 6 6 6 6 6 6 6 6 6 6 6 6 6 6 1 1 1 1 1 1 1 1 1 1 1 1 1 1 1 1 1
symmnumber: 1
zpe: 930373.8 jmol-1
zpe.correction: 0.354361 hartree
zpe.thermalcorrener: 0.380340 hartree
zpe.thermalcorrenthalpy: 0.381285 hartree
zpe.thermalcorrgfe: 0.296471 hartree
zpe.sumelectzpe: -1387.761731 hartree
zpe.sumelectthermal: -1387.735752 hartree
zpe.sumelectthermalent: -1387.734808 hartree
zpe.sumelectthermalfe: -1387.819621 hartree
dipole: 3.6044 2.9650 2.3901
dipole: 5.2436
quadrupole: -181.1744 -162.5518 -177.9472
quadrupole: 4.3232 -1.2589 2.6226
quadrupole: -7.2833 11.3394 -4.0561 4.3232 -1.2589 2.6226
hfenergy: -1388.1160921 hartree
pointgroup: C01 [X(C24H17N3O4)]
dipole: -0.8434686 -1.4840168 1.1585498 debye
polarizability: 429.9537786|27.5334294|417.2101272|-22.7995335|-45.761246|159.6505118 unknown
InChI: InChI=1S/C24H17N3O4/c1-14(28)21(24(31)25-15-8-3-2-4-9-15)27-26-19-13-7-12-18-20(19)23(30)17-11-6-5-10-16(17)22(18)29/h2-13,21,25H,1H3
charge 0 multiplicity 1
48 atoms
O  0.007097 -0.692791 0.645007
O  -5.453002 -0.638798 -0.051501
O  4.406052 1.797206 -0.861497
O  1.914675 4.894758 -0.195675
N  0.105544 1.901519 0.381327
N  0.990664 2.390695 -0.42255
N  2.794585 0.197386 -0.253126
C  -1.968478 0.593975 0.141538
C  -3.373201 0.587133 -0.113516
C  -2.102797 -1.795845 1.00943
C  -3.513169 -1.800048 0.795056
C  -1.271157 -0.625597 0.606078
C  -4.203933 -0.623677 0.184429
C  -1.232033 1.795077 -0.092201
C  -4.006206 1.733572 -0.645975
C  -1.478642 -2.930471 1.585011
C  -4.275119 -2.93846 1.153962
C  -1.874699 2.939789 -0.633176
C  -3.253847 2.897401 -0.920145
C  -2.24601 -4.054536 1.950228
C  -3.647336 -4.059872 1.732247
C  2.310416 2.545047 0.260617
C  3.289954 1.484162 -0.35358
C  2.755605 4.02511 0.149224
C  3.422153 -1.010782 -0.69065
C  4.169597 4.364596 0.559526
C  2.707515 -2.220682 -0.470031
C  4.696893 -1.048113 -1.317941
C  3.259935 -3.451409 -0.875363
C  5.234364 -2.291827 -1.715616
C  4.528309 -3.496946 -1.500757
H  -5.0822 1.687716 -0.838834
H  -0.395492 -2.908469 1.739911
H  -5.353731 -2.916996 0.969253
H  -1.277462 3.84148 -0.804749
H  -3.743414 3.776386 -1.351636
H  -1.75949 -4.925456 2.40168
H  -4.240988 -4.936162 2.012714
H  2.210031 2.313581 1.346558
H  1.851161 0.073122 0.150094
H  4.292515 5.45758 0.601603
H  4.870247 3.916221 -0.168596
H  4.415918 3.916289 1.540789
H  1.7235 -2.184354 0.010339
H  5.243611 -0.119724 -1.487951
H  2.698004 -4.37644 -0.70388
H  6.217132 -2.313437 -2.199947
H  4.956932 -4.45461 -1.815028
