program: Gaussian 09
title: 000115501
version: EM64L-G09RevD.01
frameworkgroup: C1[X(C18H29N3O)]
method: RPBEPBE
basis: SDD
operation: Freq
keyword: #p
keyword: freq=noraman
keyword: PBEPBE/SDD
title: #p freq=noraman PBEPBE/SDD
converged: YES YES NO NO
title: Mulliken charges:
elementType: O N N N C C C C C C C C C C C C C C C C C C H H H H H H H H H H H H H H H H H H H H H H H H H H H H H
charge: -0.217661 -0.094981 -0.070392 -0.469447 -0.144397 -0.441668 -0.368940 -0.358187 -0.308054 -0.291002 0.106306 -0.715991 -0.706583 0.163844 0.358777 0.375682 -0.609115 -0.606700 0.488465 -0.841108 -0.835748 -0.816703 0.187250 0.236930 0.205828 0.210275 0.177657 0.200448 0.189712 0.169221 0.239673 0.178329 0.205436 0.237741 0.214164 0.213863 0.298428 0.226460 0.216308 0.214135 0.236193 0.236290 0.241901 0.237300 0.221931 0.213277 0.219215 0.292102 0.223651 0.226597 0.233288
chargesum: 0.00000
title: Mulliken charges with hydrogens summed into heavy atoms:
elementType: O N N N C C C C C C C C C C C C C C C C C C
charge: -0.217661 -0.094981 -0.070392 -0.171020 0.042852 0.001090 0.018992 0.031973 0.100840 0.092763 0.106306 -0.050222 -0.049680 0.163844 0.358777 0.375682 -0.372922 -0.370410 0.488465 -0.139976 -0.111153 -0.133168
polarizability: 2.97964669e+02 3.01645853e+00 2.22889238e+02 -5.49713559e+00 1.29205007e+01 1.57752122e+02
1716.lowfreq: -8.0365 -0.0006 -0.0005 0.0006 3.6797 3.9113 10.7861 21.3964 31.7455
frequency: 6.1466 21.1348 31.4165 39.0065 56.4802 63.9206 74.7157 89.1876 105.0110 132.8543 144.2395 159.3561 162.7446 181.3994 196.4081 199.3134 207.5345 231.0530 235.5484 259.9397 268.4150 272.8513 279.5648 306.9266 323.9142 329.1384 350.7241 372.7053 385.8564 447.4757 463.9712 470.8840 497.3760 518.8079 528.5216 548.6764 563.0133 573.7164 578.6931 611.7981 690.7345 718.5168 729.1120 767.6993 779.9737 801.6709 805.0196 821.6054 865.3226 884.5940 894.4540 929.6726 936.2862 955.0446 963.2704 965.3150 992.3598 1014.4661 1019.9420 1038.6399 1042.2947 1045.5578 1048.4491 1057.2678 1061.1807 1069.3155 1073.1534 1102.3276 1107.7710 1114.4290 1137.2576 1145.0035 1158.8979 1169.1085 1180.3002 1207.4644 1224.3130 1241.3817 1251.7032 1260.3047 1270.2695 1287.4486 1292.8862 1308.7527 1324.6320 1328.8648 1350.1611 1358.4084 1368.9158 1370.2360 1380.7131 1386.1555 1387.3056 1391.9290 1396.2356 1397.0809 1400.0665 1415.7988 1445.0863 1452.2278 1454.9029 1458.6827 1462.7456 1464.0742 1468.4338 1470.1964 1471.1000 1472.1166 1473.8816 1476.2264 1477.4149 1489.9162 1491.6931 1492.4109 1498.7272 1599.3471 1618.9380 1629.6616 2787.9370 2827.7684 2845.3424 2848.7615 2868.1493 2903.1708 2960.8712 2973.8642 2975.3440 2986.6386 2987.2852 3009.6018 3021.9331 3032.5301 3036.5383 3049.9064 3055.0098 3056.2293 3057.8860 3080.2280 3080.5673 3084.2441 3085.9756 3086.8821 3090.1703 3093.9587 3115.7748 3119.9566 3502.2200
redmass: 1.0613 3.4046 3.7431 3.2615 3.0953 2.3163 2.4125 4.1149 2.9184 3.3754 2.7116 1.1595 3.1099 2.0349 2.1678 1.7404 1.6845 1.7354 1.6840 1.7218 2.6561 1.9447 2.8339 2.8103 4.0296 3.1312 3.2070 4.1375 2.3530 3.6005 3.3830 3.3770 3.3625 3.0625 3.6754 3.7823 3.2693 2.7792 2.3215 1.4237 5.5213 3.9804 3.8488 3.3869 2.4586 1.2056 1.2728 2.9518 1.3339 2.4572 1.3125 2.0304 2.2614 3.0407 2.6143 2.1748 2.8267 1.6028 1.6714 1.6556 2.0462 1.9135 1.5799 1.5750 2.0550 2.3980 2.1033 2.3387 1.9318 3.1360 2.3602 2.1888 2.4301 1.8923 1.7528 2.7756 1.4848 1.9621 1.3124 1.4746 1.2475 1.2656 1.2108 1.3275 5.5844 1.3021 1.5101 1.3287 3.2684 1.6082 1.4238 1.2977 1.2240 1.3886 1.2766 1.2485 1.2522 2.4562 1.6355 1.0832 1.4402 1.0869 1.0932 1.1962 1.0710 1.0504 1.1667 1.0543 1.0598 1.1022 1.0666 1.0855 1.2211 1.0727 1.4837 6.7744 5.6605 6.3149 1.0792 1.0719 1.0712 1.0708 1.0700 1.0667 1.0412 1.0387 1.0367 1.0355 1.0356 1.0881 1.0923 1.0864 1.0933 1.0893 1.0948 1.0966 1.0868 1.0983 1.0980 1.0997 1.0995 1.0978 1.1004 1.1005 1.0911 1.0919 1.0755
irintensity: 0.2876 0.6288 0.0736 0.3779 0.3957 0.1801 1.3328 0.7800 4.4339 1.1463 1.3295 1.4688 2.7985 6.0243 1.1531 0.9555 0.2196 2.1051 1.9160 0.2196 0.7426 1.2329 4.2840 1.8006 1.0612 2.2519 6.5443 1.5246 1.2472 4.5203 1.6852 1.2583 0.2017 0.3298 1.4084 2.0460 6.6566 16.2515 0.8467 53.5328 13.8944 16.7562 2.2323 19.7731 9.3563 1.4622 2.0920 0.3991 20.2561 4.3634 0.2471 0.6797 0.1045 2.2698 8.9460 6.5410 9.3862 8.8939 5.2981 2.5971 8.6584 2.4455 16.4552 18.6554 6.5633 1.5974 11.3940 15.0931 12.3263 81.3831 27.1717 7.7183 77.8872 2.1476 54.6072 2.0278 2.1074 35.1338 6.7107 17.2996 19.3658 24.1430 15.6940 21.9396 2.8013 15.0473 14.9575 8.3876 33.7402 0.8185 1.2268 15.5764 26.8514 9.4774 13.4896 21.6931 6.3186 10.8588 102.0454 7.5228 107.6191 14.7113 4.1757 46.9031 4.1907 10.5052 45.9091 7.8555 7.1478 10.6788 8.6492 6.2187 34.6609 10.1702 97.7050 5.3271 27.1404 88.7245 75.5653 91.5858 119.4681 48.4850 140.4149 65.4288 36.9742 46.6657 24.6158 31.5375 31.4739 14.6919 46.9262 18.0287 19.8763 38.3745 22.0708 15.3961 40.9389 57.5890 48.7799 15.1667 20.6060 24.6792 38.1195 31.3700 27.4731 17.3475 8.9373
temp: 298.150 k
press: 1.00000 atm
elementType: 8 7 7 7 6 6 6 6 6 6 6 6 6 6 6 6 6 6 6 6 6 6 1 1 1 1 1 1 1 1 1 1 1 1 1 1 1 1 1 1 1 1 1 1 1 1 1 1 1 1 1
symmnumber: 1
zpe: 1157207.6 jmol-1
zpe.correction: 0.440757 hartree
zpe.thermalcorrener: 0.465204 hartree
zpe.thermalcorrenthalpy: 0.466148 hartree
zpe.thermalcorrgfe: 0.383958 hartree
zpe.sumelectzpe: -941.082162 hartree
zpe.sumelectthermal: -941.057715 hartree
zpe.sumelectthermalent: -941.056771 hartree
zpe.sumelectthermalfe: -941.138961 hartree
dipole: 0.0508 -0.9856 -3.1515
dipole: 3.3024
quadrupole: -118.8517 -126.4091 -140.4696
quadrupole: 1.3137 1.0904 -1.4027
quadrupole: 9.7251 2.1677 -11.8928 1.3137 1.0904 -1.4027
hfenergy: -941.5229189 hartree
pointgroup: C01 [X(C18H29N3O1)]
dipole: 0.0077341 0.4174007 1.2303724 debye
polarizability: 298.045739|-1.0467557|223.3672208|5.4961332|11.4968909|157.19307 unknown
InChI: InChI=1S/C18H29N3O/c1-6-20-8-9-21(7-2)16(12-20)18(22)19-17-14(4)10-13(3)11-15(17)5/h10-11,16,19H,6-9,12H2,1-5H3
charge 0 multiplicity 1
51 atoms
O  0.018946 -0.574688 -1.579296
N  2.450506 -1.346732 0.131833
N  3.734103 1.261583 -0.114867
N  -0.774599 0.017205 0.547324
C  1.6624 -0.090007 0.200914
C  2.36456 1.016925 -0.623175
C  3.834555 -1.103318 0.611906
C  4.519764 0.006829 -0.198354
C  1.784017 -2.478228 0.828189
C  4.37375 2.410795 -0.806924
C  0.237352 -0.265121 -0.373961
C  2.469247 -3.833742 0.575876
C  5.687333 2.865211 -0.144653
C  -2.186327 0.111358 0.274099
C  -2.843384 1.334076 0.603243
C  -2.91164 -0.98793 -0.266768
C  -4.23171 1.446425 0.366857
C  -4.298507 -0.819046 -0.502008
C  -4.979375 0.381924 -0.193492
C  -2.064535 2.504669 1.178936
C  -2.249682 -2.316682 -0.565887
C  -6.474348 0.516187 -0.427656
H  1.593096 0.271318 1.264904
H  2.353532 0.692878 -1.691444
H  1.783873 1.955582 -0.540511
H  4.41646 -2.034327 0.501763
H  3.843605 -0.814221 1.695036
H  5.528109 0.178564 0.217445
H  4.631418 -0.333882 -1.259057
H  1.712859 -2.292134 1.933315
H  0.750019 -2.536508 0.443211
H  4.558831 2.182939 -1.889089
H  3.650761 3.249001 -0.778446
H  2.592045 -3.996843 -0.509139
H  3.461636 -3.904068 1.055361
H  1.847383 -4.651181 0.984358
H  -0.460541 0.348267 1.463879
H  5.525447 3.060053 0.930271
H  6.488903 2.111487 -0.243313
H  6.049466 3.795224 -0.619842
H  -4.73668 2.389387 0.611651
H  -4.860941 -1.659324 -0.928299
H  -1.19394 2.761828 0.546664
H  -2.70484 3.398984 1.257935
H  -1.676589 2.293005 2.196351
H  -1.62112 -2.649138 0.282142
H  -3.004034 -3.097461 -0.76205
H  -1.583667 -2.230632 -1.44365
H  -6.759123 1.563227 -0.633354
H  -6.806756 -0.101581 -1.280319
H  -7.049536 0.187766 0.460192
