program: Gaussian 09
title: 000115300
version: EM64L-G09RevD.01
frameworkgroup: C1[X(C15H16O4)]
method: RPBEPBE
basis: SDD
operation: Freq
keyword: #pfreq=noraman
keyword: PBEPBE/SDD
title: #p freq=noraman PBEPBE/SDD
converged: YES YES NO NO
title: Mulliken charges:
elementType: O O O O C C C C C C C C C C C C C C C H H H H H H H H H H H H H H H H
charge: -0.445284 -0.458968 -0.482910 -0.330898 0.184421 -0.160661 0.360456 0.171744 -0.049678 0.235692 -0.728852 -0.718249 -0.718610 -0.121837 0.203893 0.521539 -0.601471 -0.823672 -0.230120 0.205105 0.235151 0.209970 0.217269 0.262579 0.209856 0.263126 0.217143 0.220442 0.229883 0.229406 0.230127 0.296324 0.397255 0.402734 0.367095
chargesum: 0.00000
title: Mulliken charges with hydrogens summed into heavy atoms:
elementType: O O O O C C C C C C C C C C C C C C C
charge: -0.048028 -0.056234 -0.115815 -0.330898 0.184421 0.044445 0.360456 0.171744 -0.049678 0.235692 -0.493702 -0.028430 -0.028485 -0.121837 0.203893 0.521539 -0.381029 -0.134257 0.066204
polarizability: 2.48846476e+02 -1.44688751e+01 2.45196362e+02 1.43277539e-02 1.41852066e-02 9.36663128e+01
1716.lowfreq: 0.0006 0.0008 0.0009 5.3484 7.3252 10.1041 45.4738 59.8923 64.9680
frequency: 45.3592 59.8021 64.8428 71.2508 123.2812 147.3226 178.3535 199.3199 214.1447 215.2028 223.1626 245.2466 253.1590 261.8582 289.7415 306.9203 319.2701 334.1189 370.8822 380.6136 398.5376 404.4249 425.5720 452.5934 466.2598 504.5902 535.0889 561.7724 583.3306 593.6071 593.8003 602.8059 638.2449 667.2477 719.9124 753.5392 796.1734 836.7856 840.0316 882.5327 902.8308 928.9018 949.1087 954.9554 961.6909 979.6795 1001.4422 1049.1756 1050.4190 1071.0279 1109.8381 1127.5541 1133.5961 1142.0174 1156.7690 1173.1000 1184.3646 1253.3919 1273.7808 1286.1913 1295.6377 1307.9444 1331.4677 1341.2749 1369.1973 1378.9652 1379.2652 1397.4965 1400.9635 1414.4642 1436.1325 1462.1910 1465.5040 1469.8534 1479.8871 1482.1499 1482.7731 1499.6271 1522.9525 1572.9047 1583.4947 1613.6943 1628.2850 2089.8784 2976.1193 2983.2063 2984.7899 3041.7054 3052.5301 3070.4764 3074.2669 3088.0895 3099.8416 3107.8599 3113.5663 3144.1972 3165.4999 3407.6527 3579.1759
redmass: 4.2361 4.9736 1.7115 1.4396 3.8528 6.2598 3.1765 3.8680 3.1401 2.3605 1.4305 1.1784 2.9898 3.1390 5.5533 4.4077 3.5007 7.5855 1.2648 4.5245 5.1378 4.5050 3.3919 4.6291 4.8781 4.2821 6.8851 4.6655 2.8967 3.9994 1.1864 5.3843 5.1413 5.4020 5.5221 7.1369 2.7002 3.1771 1.6930 1.7867 2.9619 1.1766 4.4511 1.6789 1.4261 4.0024 1.8028 1.5437 2.7081 2.5945 2.7414 2.1462 1.0530 3.1078 2.3383 1.9249 1.3247 2.1522 1.9387 1.8589 1.2960 2.5442 2.0066 2.0502 2.9817 1.1951 3.4970 1.3207 1.2948 3.2707 2.8216 2.5458 1.0407 1.0454 1.1101 1.3502 1.0537 1.0752 3.6995 4.5584 3.2679 6.4005 6.6158 1.0845 1.0376 1.0361 1.0367 1.0825 1.0976 1.1002 1.0994 1.0982 1.0916 1.0992 1.0983 1.0932 1.0896 1.0637 1.0658
irintensity: 0.1085 0.0336 1.1927 0.0103 0.5332 0.5941 1.7940 1.3528 0.4787 0.0178 0.0024 0.0645 0.3197 0.4114 30.4591 2.1684 0.3010 2.4192 119.1254 7.0957 9.6947 1.8263 2.0856 8.1700 2.1024 4.1437 5.6668 0.5863 0.2305 12.0885 133.9874 2.4030 8.7433 8.5451 0.1194 51.2864 15.6858 24.0567 24.4061 4.3128 2.5056 5.8514 34.3457 0.6794 0.0028 16.9954 1.5573 10.8730 48.6412 1.2056 2.2236 72.0115 153.2916 164.5865 215.1687 78.4141 26.9649 41.8870 10.6196 219.8015 0.7974 27.1073 6.2248 137.8295 79.2562 22.1801 88.5408 22.5146 14.6082 22.1749 146.7239 96.4830 0.5041 13.7961 3.0536 4.4601 3.6860 8.8824 11.1418 141.9416 203.1915 78.7324 18.7406 356.2989 45.3997 41.5348 48.4748 15.0020 19.4504 18.6695 62.5262 14.6734 20.5292 0.9329 23.8493 3.5822 11.2743 102.6645 31.3259
temp: 298.150 k
press: 1.00000 atm
elementType: 8 8 8 8 6 6 6 6 6 6 6 6 6 6 6 6 6 6 6 1 1 1 1 1 1 1 1 1 1 1 1 1 1 1 1
symmnumber: 1
zpe: 721022.3 jmol-1
zpe.correction: 0.274623 hartree
zpe.thermalcorrener: 0.292681 hartree
zpe.thermalcorrenthalpy: 0.293625 hartree
zpe.thermalcorrgfe: 0.229672 hartree
zpe.sumelectzpe: -880.725488 hartree
zpe.sumelectthermal: -880.707430 hartree
zpe.sumelectthermalent: -880.706486 hartree
zpe.sumelectthermalfe: -880.770439 hartree
dipole: 4.4319 -2.7346 0.0018
dipole: 5.2076
quadrupole: -94.1681 -117.7632 -115.3544
quadrupole: 4.5165 -0.0010 0.0045
quadrupole: 14.9271 -8.6679 -6.2591 4.5165 -0.0010 0.0045
hfenergy: -881.0001112 hartree
pointgroup: C01 [X(C15H16O4)]
dipole: 1.2287453 -1.6391766 -0.0315414 debye
polarizability: 238.4359525|-11.9390878|255.3501359|2.7022075|5.5351481|93.9230624 unknown
InChI: InChI=1S/C15H16O4/c1-7(2)12-9-4-8(3)5-11(17)13(9)10(6-16)14(18)15(12)19/h4-7,17-19H,1-3H3
charge 0 multiplicity 1
35 atoms
O  -3.209937 1.055171 0.011155
O  -1.552605 3.077454 0.118571
O  3.302945 1.078835 0.154562
O  0.646505 4.078328 0.204454
C  -1.386398 -0.583387 -0.005795
C  -2.401355 -1.729422 -0.066514
C  0.061349 -0.803565 0.017415
C  0.987098 0.319632 0.077048
C  -1.8495 0.734802 0.029725
C  0.464585 1.680834 0.114213
C  0.590946 -2.136435 -0.018834
C  -3.245567 -1.674919 -1.371494
C  -3.307015 -1.756684 1.197429
C  -0.950639 1.846672 0.088497
C  2.385999 0.006166 0.096075
C  1.964981 -2.408179 0.00071
C  2.864739 -1.309668 0.059285
C  2.496102 -3.829001 -0.039318
C  1.233867 2.910987 0.176232
H  -1.857756 -2.688141 -0.083789
H  -0.093358 -2.985976 -0.064003
H  -3.927906 -2.544354 -1.409768
H  -2.59734 -1.706225 -2.266237
H  -3.850432 -0.754748 -1.408951
H  -3.990861 -2.624366 1.146914
H  -3.912621 -0.838768 1.265882
H  -2.702144 -1.848482 2.118025
H  3.948034 -1.495153 0.07599
H  3.108832 -4.055417 0.853756
H  1.674598 -4.563984 -0.078296
H  3.138256 -3.994398 -0.925116
H  2.328533 2.876471 0.19952
H  -3.271066 2.053302 0.045444
H  -0.72112 3.795785 0.162528
H  4.231253 0.737434 0.162886
