program: Gaussian 09
title: 000115463
version: EM64L-G09RevD.01
frameworkgroup: C1[X(C24H29N5)]
method: RPBEPBE
basis: SDD
operation: Freq
keyword: #pfreq=noraman
keyword: PBEPBE/SDD
title: #p freq=noraman PBEPBE/SDD
converged: YES YES NO NO
title: Mulliken charges:
elementType: N N N N N C C C C C C C C C C C C C C C C C C C C C C C C H H H H H H H H H H H H H H H H H H H H H H H H H H H H H
charge: -0.079469 -0.119519 -0.348636 -0.091280 -0.091542 -0.361911 -0.348401 -0.387301 -0.394674 -0.362353 -0.374387 -0.210638 -0.640002 0.110047 0.496088 0.511389 -0.389880 -0.439887 -0.397468 -0.424499 -0.235189 -0.225477 -0.245392 -0.281323 -0.281408 -0.231192 -0.230288 -0.199727 -0.244147 0.215812 0.187268 0.190184 0.207619 0.216891 0.263621 0.263734 0.217705 0.225659 0.162800 0.192019 0.244595 0.218920 0.240544 0.243962 0.191965 0.266904 0.237171 0.245329 0.228033 0.221849 0.223605 0.225516 0.240511 0.240346 0.225042 0.222296 0.232121 0.226446
chargesum: 0.00000
title: Mulliken charges with hydrogens summed into heavy atoms:
elementType: N N N N N C C C C C C C C C C C C C C C C C C C C C C C C
charge: -0.079469 -0.119519 -0.108092 -0.091280 -0.091542 0.041169 0.049403 0.093211 0.086765 0.026106 0.062227 0.008283 -0.204075 0.110047 0.496088 0.511389 -0.122977 -0.202717 -0.152139 -0.196466 -0.013340 -0.001872 -0.019877 -0.040812 -0.041061 -0.006150 -0.007993 0.032393 -0.017700
polarizability: 3.84374445e+02 1.74310738e+01 2.77512895e+02 3.38278849e+01 -2.44406486e+01 2.11412460e+02
1716.lowfreq: -8.5568 -0.7684 -0.0011 -0.0008 0.0009 2.6410 11.0988 14.5579 18.8997
frequency: 10.9967 13.8593 18.7753 28.2598 34.4985 34.6922 47.9790 60.1607 73.7306 87.0497 109.5818 117.2203 133.4722 141.7453 154.3052 186.7363 214.8822 222.0394 244.8645 267.5894 299.2529 312.5226 336.6414 347.3734 377.6923 403.0938 405.6391 405.8551 407.6313 443.1622 452.6503 472.9457 495.9631 503.6880 513.5847 545.1643 563.5510 575.9592 601.8174 615.7814 617.8000 626.1065 627.2380 685.8448 704.0821 707.1129 729.4777 748.6722 762.6012 769.1874 778.1685 783.6717 791.2819 808.6559 822.0977 842.1206 852.5046 858.6446 915.1893 920.2143 924.7522 936.1332 939.6532 953.5744 961.4294 963.0330 974.7287 982.4675 990.2877 990.4285 992.5506 996.3484 998.5815 1012.5657 1021.5670 1028.3115 1031.3000 1044.4134 1050.3408 1062.4528 1068.2473 1074.8561 1077.9767 1083.1749 1095.3862 1115.4202 1135.1536 1141.3001 1145.1855 1164.8268 1169.6701 1172.0715 1178.7646 1181.0656 1188.6385 1196.9584 1206.9259 1211.4285 1220.3706 1243.8168 1264.4998 1265.9314 1275.3020 1291.4805 1292.9828 1296.1326 1303.0717 1316.4714 1320.9721 1328.9014 1330.9449 1346.7845 1349.1384 1355.1590 1365.6227 1382.8486 1383.9033 1387.5313 1397.4615 1405.7081 1439.5690 1440.9322 1454.6918 1458.8511 1459.4144 1461.7390 1466.2567 1470.8850 1474.3974 1482.5957 1485.3052 1493.4405 1505.6830 1522.5498 1571.4771 1592.7792 1594.1710 1612.3019 1614.9597 2825.1760 2847.6694 2856.7875 2860.7994 2876.6783 2971.1769 2978.5603 2981.6293 3034.8132 3038.9302 3047.0609 3050.6679 3056.2758 3103.0884 3104.5729 3110.2968 3115.5680 3120.9867 3121.4232 3125.0718 3125.7987 3132.9524 3134.5791 3144.2070 3144.8901 3160.1442 3161.4893 3187.2012 3427.6112
redmass: 5.5431 4.4754 4.5760 4.2716 4.1151 5.1487 4.0734 4.4565 4.0300 4.0916 3.2457 4.8618 5.5006 2.5737 3.6355 3.6275 3.8394 3.9946 4.0654 2.0826 4.4522 2.3733 2.9816 2.6358 3.1829 2.8026 2.3573 2.4412 4.2069 3.8877 3.9288 2.7310 4.2153 3.3650 2.8104 4.2606 3.3446 2.8472 3.4082 6.2537 6.2414 2.0978 7.3128 1.8803 1.7404 1.7308 5.1234 2.2081 2.2606 2.7387 1.8418 2.2996 2.5747 1.3311 3.2915 1.5607 1.2487 1.2518 1.5044 5.4824 1.4503 2.1589 2.0322 1.3716 3.8121 1.4889 1.3933 1.4062 4.6421 5.8197 1.4731 2.3382 1.4535 2.9480 2.6264 2.1700 2.2130 2.6069 1.7558 2.2934 2.1095 1.6451 1.7748 1.6859 2.1673 2.3905 3.8102 2.3642 2.6269 1.3609 1.0626 1.0743 1.7379 1.1518 1.1231 1.1010 1.9576 1.6082 2.5037 2.1468 1.4015 2.0651 1.2160 1.3816 1.2985 1.4540 1.8597 1.3570 1.3251 1.2615 1.2514 1.5026 1.3575 1.3768 1.4471 7.6057 1.7120 4.8500 1.4633 1.8666 2.1297 2.1194 1.1077 1.2255 1.1054 1.1154 1.1188 1.1424 1.1001 2.2035 2.1980 1.0830 5.6287 4.4005 5.7450 6.0106 6.1211 6.1336 6.1342 1.0710 1.0712 1.0817 1.0697 1.0712 1.0640 1.0676 1.0682 1.0871 1.0867 1.0889 1.0975 1.0908 1.0940 1.0950 1.0873 1.0856 1.0870 1.0859 1.0903 1.0926 1.0914 1.0913 1.0961 1.0957 1.1014 1.1015 1.0981 1.0738
irintensity: 0.0112 0.0453 0.0712 0.0300 0.2332 0.0450 0.0832 0.0241 0.7139 0.2452 3.2364 0.7117 4.0898 1.5750 1.5033 0.7694 1.6419 4.1234 2.6593 3.5661 2.8989 8.9791 2.2059 1.2450 1.7917 0.0747 0.7528 0.1783 0.0002 4.2106 5.6517 1.3302 13.2501 7.2183 1.6087 9.1552 28.0808 14.2433 21.5009 0.3903 0.1962 17.5106 2.4225 28.7899 53.1452 64.8453 1.1423 16.0901 16.5933 3.2266 13.5196 54.1069 50.3719 0.9448 7.2071 0.1446 0.0998 0.5297 1.1620 2.4272 10.0473 1.4224 2.4875 0.0022 75.7689 3.7509 0.0405 0.4771 0.9946 0.4374 3.3858 52.1726 2.5067 17.4021 15.2921 5.9319 20.5102 3.6075 2.3303 1.6982 0.3855 10.5947 2.0782 11.4785 23.5729 10.0662 81.0940 17.4880 50.9964 0.7243 0.4011 0.0779 4.7085 0.6222 0.7287 4.2638 7.5605 0.9187 2.5792 8.5278 92.9653 3.4341 8.7992 15.2773 7.2222 19.5509 44.1679 13.9618 4.4173 0.3505 1.7954 26.5030 1.4761 86.8612 24.0815 0.0989 76.4457 2.7259 7.3768 0.0172 7.9699 20.5403 20.6302 24.7613 46.0444 13.3438 14.3348 5.1113 7.1491 18.4005 9.8099 5.6055 79.5835 205.8349 662.1720 0.9500 0.9553 3.7970 6.7575 80.8487 44.6630 59.3343 153.0379 107.7418 47.2354 10.7735 95.6223 7.3907 47.8622 46.4199 16.8780 34.2627 4.7686 6.5330 10.6965 5.4894 0.8571 1.4844 28.0640 31.4819 16.3142 15.8766 43.0296 33.1020 27.0018 23.8712 18.4475 3.4682
temp: 298.150 k
press: 1.00000 atm
elementType: 7 7 7 7 7 6 6 6 6 6 6 6 6 6 6 6 6 6 6 6 6 6 6 6 6 6 6 6 6 1 1 1 1 1 1 1 1 1 1 1 1 1 1 1 1 1 1 1 1 1 1 1 1 1 1 1 1 1
symmnumber: 1
zpe: 1278019.6 jmol-1
zpe.correction: 0.486772 hartree
zpe.thermalcorrener: 0.512871 hartree
zpe.thermalcorrenthalpy: 0.513815 hartree
zpe.thermalcorrgfe: 0.425112 hartree
zpe.sumelectzpe: -1203.565284 hartree
zpe.sumelectthermal: -1203.539186 hartree
zpe.sumelectthermalent: -1203.538242 hartree
zpe.sumelectthermalfe: -1203.626944 hartree
dipole: 0.0525 -1.1169 -0.3698
dipole: 1.1777
quadrupole: -164.2549 -163.0578 -171.5284
quadrupole: 5.2125 8.4969 -3.0854
quadrupole: 2.0254 3.2226 -5.2480 5.2125 8.4969 -3.0854
hfenergy: -1204.0520564 hartree
pointgroup: C01[X(C24H29N5)]
dipole: -0.0328687 -0.4497734 0.1062645 debye
polarizability: 383.2757185|-23.335136|273.9128374|32.705894|29.0032676|216.1112441 unknown
InChI: InChI=1S/C24H29N5/c1-3-8-21(9-4-1)20-23(22-10-5-2-6-11-22)25-14-15-28-16-18-29(19-17-28)24-26-12-7-13-27-24/h1-13,23,25H,14-20H2
charge 0 multiplicity 1
58 atoms
N  2.209083 0.165965 0.486586
N  4.962872 0.090283 -0.318578
N  -1.482094 -0.495016 1.090267
N  7.147106 0.355003 0.5431
N  6.621319 -1.406829 -1.087028
C  3.265938 0.747848 1.353125
C  2.743646 -0.994663 -0.270901
C  4.465069 1.210772 0.50187
C  3.93626 -0.566747 -1.148854
C  0.959726 -0.137866 1.222654
C  -0.279242 -0.145812 0.304267
C  -2.772479 -0.423345 0.363552
C  -3.872803 -1.055148 1.283629
C  6.274159 -0.330813 -0.285973
C  -3.112737 1.025942 0.00281
C  -5.209538 -1.257414 0.589105
C  -2.894922 2.063899 0.94434
C  -3.688095 1.347539 -1.24929
C  -6.215427 -0.258214 0.631911
C  -5.470397 -2.447832 -0.1387
C  -3.248731 3.396053 0.639813
C  -4.045499 2.680718 -1.557868
C  -3.827758 3.709863 -0.613585
C  8.435262 -0.073848 0.548689
C  7.921544 -1.795227 -1.044171
C  -7.448073 -0.44181 -0.034041
C  -6.700843 -2.636011 -0.807929
C  8.89375 -1.158667 -0.236292
C  -7.695566 -1.631649 -0.757236
H  2.845484 1.620134 1.886297
H  3.627364 0.015015 2.119609
H  3.074644 -1.812686 0.420323
H  1.950424 -1.401943 -0.922482
H  4.133389 2.029374 -0.1683
H  5.291231 1.570352 1.133272
H  4.397827 -1.432274 -1.647277
H  3.578706 0.149258 -1.916133
H  0.804207 0.642405 1.98979
H  1.029425 -1.116099 1.769871
H  -0.119582 -0.835804 -0.560503
H  -0.411785 0.866164 -0.11587
H  -2.751453 -1.017124 -0.585116
H  -1.372814 -1.401257 1.566957
H  -3.979607 -0.406638 2.172226
H  -3.490152 -2.03576 1.635601
H  -2.425294 1.809258 1.901587
H  -3.862569 0.551475 -1.983676
H  -6.025925 0.669399 1.184827
H  -4.707121 -3.236289 -0.172755
H  -3.071104 4.190704 1.374013
H  -4.490751 2.914597 -2.531671
H  -4.100785 4.744244 -0.85219
H  9.116122 0.477154 1.208558
H  8.183506 -2.647503 -1.682642
H  -8.213445 0.341323 0.01136
H  -6.886643 -3.563874 -1.361211
H  9.935301 -1.486025 -0.218453
H  -8.652428 -1.776453 -1.271585
