program: Gaussian 09
title: 000115020
version: EM64L-G09RevD.01
frameworkgroup: C1[X(C6H4N2O)]
method: RPBEPBE
basis: SDD
operation: Freq
keyword: #pfreq=noraman
keyword: PBEPBE/SDD
title: #p freq=noraman PBEPBE/SDD
converged: NO YES NO NO
title: Mulliken charges:
elementType: O N N C C C C C C H H H H
charge: -0.233861 -0.003472 0.023359 0.201839 0.033657 -0.334650 -0.282489 -0.216680 -0.178491 0.254033 0.262264 0.241004 0.233487
chargesum: 0.00000
title: Mulliken charges with hydrogens summed into heavy atoms:
elementType: O N N C C C C C C
charge: -0.233861 -0.003472 0.023359 0.201839 0.033657 -0.080618 -0.020225 0.024325 0.054996
polarizability: 1.34923261e+02 4.86801292e+00 9.00782891e+01 -3.43473318e-03 1.43114804e-04 3.10580193e+01
1716.lowfreq: -8.6094 -0.0008 -0.0007 0.0006 3.0943 10.3473 82.5937 115.6775 203.0993
frequency: 82.5932 115.6717 203.0985 381.2177 393.0868 439.0172 480.0727 545.9869 549.0283 578.1789 678.5443 723.2483 748.9151 843.3301 847.3956 946.9140 986.5997 992.9859 1096.6139 1141.4085 1196.5866 1238.4763 1288.6656 1369.3446 1450.7443 1525.2138 1533.6397 1620.7384 2016.2439 3135.2691 3152.1825 3167.7771 3180.2858
redmass: 11.1592 5.8374 6.1309 3.9692 8.7314 12.2640 3.3485 5.1764 7.5528 7.0666 5.8805 2.7041 1.4559 6.5139 1.6072 1.3194 1.3331 2.5205 2.7706 1.4591 1.4935 2.3003 1.9293 1.8676 2.7983 8.1360 7.6021 6.3427 13.8609 1.0871 1.0887 1.0952 1.1006
irintensity: 1.7011 1.5731 0.7080 0.9530 2.2068 0.0056 11.9667 0.2159 0.4716 11.3523 10.7762 10.2984 93.7983 3.3177 6.8410 0.8801 0.3913 6.5012 5.1500 22.8776 9.9916 18.0107 16.4728 8.8707 8.0513 160.6613 84.5614 99.5253 484.6251 10.8765 0.4953 8.4740 12.9898
temp: 298.150 k
press: 1.00000 atm
elementType: 8 7 7 6 6 6 6 6 6 1 1 1 1
symmnumber: 1
zpe: 231172.8 jmol-1
zpe.correction: 0.088049 hartree
zpe.thermalcorrener: 0.095313 hartree
zpe.thermalcorrenthalpy: 0.096257 hartree
zpe.thermalcorrgfe: 0.055900 hartree
zpe.sumelectzpe: -415.084013 hartree
zpe.sumelectthermal: -415.076749 hartree
zpe.sumelectthermalent: -415.075804 hartree
zpe.sumelectthermalfe: -415.116161 hartree
dipole: 2.8786 -3.6013 -0.0001
dipole: 4.6104
quadrupole: -49.4992 -51.0199 -53.0811
quadrupole: 4.7529 0.0019 0.0003
quadrupole: 1.7009 0.1802 -1.8811 4.7529 0.0019 0.0003
hfenergy: -415.1720616 hartree
pointgroup: C01 [X(C6H4N2O1)]
dipole: -0.9235587 1.5611547 0.0002508 debye
dipolederiv: -0.3920963 0.5432933 0.0001894 0.1138642 -0.929435 -0.0002049 -0.000026 -0.0000546 -0.332505 2.0317125 0.6138757 0.0003593 -0.4226852 -0.427926 -0.0001769 0.0010662 0.0003209 0.1379214 -1.2552563 -0.4641379 -0.0000805 0.380304 0.2150329 0.0000752 -0.0008891 -0.0003237 -0.0453469 -1.1159652 -0.4130449 -0.0004318 0.0648869 -0.1576177 -0.0000319 -0.0002519 -0.0001074 -0.0127218 0.5704145 -0.5910286 -0.0001473 0.1534306 1.0648882 0.0003235 0.0001677 0.0000787 0.1580977 0.5797492 0.0534836 0.00013 -0.3656871 0.0668207 0.0000062 -0.0000184 0.0000658 -0.1054375 -0.1695129 0.4893923 0.0001502 -0.0046563 -0.1274663 0.0000073 -0.0000574 0.0000515 -0.1935665 -0.4855359 -0.2215185 -0.000124 -0.2209171 -0.076216 0.0000086 -0.0000499 0.0000469 -0.2007381 0.2427031 0.0314096 0.0000203 0.2946029 0.3477616 0.0001731 0.0001087 0.0001224 -0.0900056 0.0535222 -0.0728711 -0.0000336 -0.0077845 -0.0187595 -0.0000533 -0.0000285 -0.0000673 0.1809217 0.0355307 -0.0284405 -0.0000165 -0.0664454 -0.0191382 -0.0000586 -0.0000076 -0.0000366 0.1774549 0.0278467 0.0840796 0.0000078 0.0806234 -0.0365465 -0.0000582 -0.0000069 -0.0000683 0.176893 -0.1231122 -0.0244925 -0.0000233 0.0004637 0.0986019 -0.0000101 -0.0000069 -0.0000284 0.1490326 unknown
polarizability: 135.3949621|-1.523636|89.6065801|0.0203226|0.0155089|31.0580274 unknown
InChI: InChI=1S/C6H4N2O/c7-8-5-3-1-2-4-6(5)9/h1-4H
charge 0 multiplicity 1
13 atoms
O  0.677836 -2.065995 -0.000608
N  1.839236 0.427673 0.000055
N  2.978591 0.131533 0.000835
C  0.498215 0.378568 -0.000098
C  -0.065434 -1.02896 -0.000538
C  -0.318259 1.561589 0.000216
C  -1.526957 -1.045609 -0.00059
C  -1.698201 1.427102 0.000071
C  -2.292038 0.111872 -0.000324
H  0.162459 2.544893 0.000544
H  -1.989475 -2.037829 -0.000852
H  -2.337182 2.314487 0.00028
H  -3.38509 0.028476 -0.000392
