program: Gaussian 09
title: 000115146
version: EM64L-G09RevD.01
frameworkgroup: C1[X(C9H20N2O2)]
method: RPBEPBE
basis: SDD
operation: Freq
keyword: #p
keyword: freq=noraman
keyword: PBEPBE/SDD
title: #p freq=noraman PBEPBE/SDD
converged: NO YES NO NO
title: Mulliken charges:
elementType: O O N N C C C C C C C C C H H H H H H H H H H H H H H H H H H H H
charge: -0.411035 -0.436464 -0.083219 -0.555583 -0.387436 -0.407734 -0.391816 -0.617282 -0.572586 -0.590042 -0.398861 -0.241751 0.103949 0.220980 0.331314 0.267429 0.198296 0.199983 0.198562 0.389595 0.228235 0.214810 0.260446 0.245120 0.248354 0.217628 0.232229 0.356565 0.219862 0.206453 0.223253 0.262240 0.268508
chargesum: 0.00000
title: Mulliken charges with hydrogens summed into heavy atoms:
elementType: O O N N C C C C C C C C C
charge: -0.411035 -0.436464 -0.083219 -0.024836 0.164858 0.057991 0.006729 0.215358 0.181333 0.216380 0.027453 -0.018498 0.103949
polarizability: 1.42493068e+02 2.62898396e+00 1.09929753e+02 1.69768326e+00 6.32551189e-01 1.03721015e+02
1716.lowfreq: -8.7801 -0.0011 -0.0007 -0.0004 9.5281 13.4685 47.5361 68.1050 106.7844
frequency: 47.2749 68.0351 106.7052 115.3747 141.9006 165.5243 196.9129 235.2609 237.6229 249.6182 261.9973 293.5590 307.1407 322.4006 344.0026 356.1496 362.2040 377.1401 437.3486 458.8467 465.9721 498.1136 512.7394 624.1336 715.8223 738.7466 755.8144 781.9853 797.1056 838.5168 864.6605 903.7745 933.2338 947.4330 972.3463 996.1779 1037.7839 1059.9168 1069.4112 1073.2787 1098.4763 1118.9150 1121.2000 1160.9297 1188.7897 1213.1384 1224.7391 1248.7799 1256.4330 1258.3022 1281.4203 1310.9387 1314.6190 1332.4968 1338.5742 1342.6535 1363.9305 1413.5334 1425.3758 1443.4453 1448.0548 1455.1414 1457.5813 1465.8809 1469.4601 1472.0129 1475.9239 1479.0265 1489.8589 1509.1058 1519.9166 1531.0186 1641.5289 2842.8498 2925.8462 2963.2428 2970.0706 2975.0062 2982.0459 3012.1827 3019.7681 3029.6426 3044.0716 3047.4387 3062.6415 3073.3086 3077.0683 3117.8857 3122.7385 3126.1553 3131.8750 3382.8013 3505.8894
redmass: 4.9890 4.2745 3.4576 3.9099 3.7190 3.4774 2.9274 1.8151 2.7379 1.4756 1.8079 2.6621 1.4388 1.1541 2.0769 2.4645 1.3356 2.0800 2.3888 2.4760 2.5344 4.1804 2.5303 3.6803 2.7741 4.3912 2.1945 2.2549 1.5436 2.7016 2.8221 2.5025 2.6863 2.5548 2.2201 2.1331 1.6636 1.2004 1.6396 2.8810 2.2520 1.3848 1.3002 1.5503 1.3105 1.5915 1.7452 1.3831 1.7050 1.8099 1.5170 1.3065 2.0185 1.3603 1.3718 1.2236 1.4090 1.1351 1.1400 1.1281 1.2174 1.2314 1.2385 1.0907 1.0589 1.0884 1.1102 1.0464 1.1058 1.1316 1.1140 1.5284 1.0859 1.0669 1.0488 1.0639 1.0632 1.0621 1.0653 1.0323 1.0875 1.0959 1.1005 1.1000 1.0776 1.0939 1.0974 1.1046 1.1040 1.1039 1.1036 1.0454 1.0935
irintensity: 3.3377 5.8485 3.9444 0.5769 12.9342 5.4392 5.8462 9.5314 5.8017 10.2011 28.8600 3.5739 74.4282 8.7874 1.7613 5.9962 1.7691 2.0260 3.2870 14.1138 3.9119 6.8253 2.9441 8.9579 9.3558 5.2452 24.7815 117.9918 121.2966 8.6842 55.1574 9.3714 12.1649 6.9587 6.8323 16.7991 7.8945 1.8340 5.7605 10.5401 5.8343 3.1681 3.7104 0.6399 2.6482 11.7029 1.8844 13.3526 27.8551 41.8710 25.2952 7.3310 25.6011 5.7378 30.8720 14.7330 8.0042 37.7422 8.2190 53.0420 78.5455 61.8280 28.3922 23.3738 1.4411 7.7549 3.0295 17.8270 16.1463 45.6180 51.5531 64.9300 33.8514 271.9723 149.9279 55.3359 194.5997 18.3328 23.6734 22.2257 9.6778 70.0201 10.9354 43.0647 11.1156 15.9090 10.6644 4.1394 9.3442 27.7283 17.0054 2.0136 1.1333
temp: 298.150 k
press: 1.00000 atm
elementType: 8 8 7 7 6 6 6 6 6 6 6 6 6 1 1 1 1 1 1 1 1 1 1 1 1 1 1 1 1 1 1 1 1
symmnumber: 1
zpe: 765345.1 jmol-1
zpe.correction: 0.291505 hartree
zpe.thermalcorrener: 0.306483 hartree
zpe.thermalcorrenthalpy: 0.307428 hartree
zpe.thermalcorrgfe: 0.250866 hartree
zpe.sumelectzpe: -613.769720 hartree
zpe.sumelectthermal: -613.754742 hartree
zpe.sumelectthermalent: -613.753797 hartree
zpe.sumelectthermalfe: -613.810359 hartree
dipole: -9.9278 3.8455 -0.5087
dipole: 10.6586
quadrupole: -69.0599 -84.3440 -83.4014
quadrupole: -0.2908 -1.2389 0.0826
quadrupole: 9.8752 -5.4089 -4.4663 -0.2908 -1.2389 0.0826
hfenergy: -614.061225 hartree
pointgroup: C01 [X(C9H20N2O2)]
dipole: 3.938847 0.9069078 1.1170886 debye
polarizability: 142.1742139|-4.5556878|108.5178626|0.118174|2.8300099|105.45176 unknown
InChI: InChI=1S/C9H20N2O2/c1-11(2,3)7-5-4-6-8(10)9(12)13/h8H,4-7,10H2,1-3H3
charge 0 multiplicity 1
33 atoms
O  -0.531875 -0.088851 -1.883345
O  -0.055479 -1.78547 -0.361904
N  2.845852 -0.153886 -0.176414
N  -3.206787 -0.231579 -0.551152
C  1.739529 0.220741 0.865846
C  1.000608 1.549219 0.635664
C  -0.350964 1.552694 1.430947
C  2.466275 0.23468 -1.609086
C  4.155691 0.516364 0.193896
C  2.988969 -1.677319 -0.129127
C  -1.622929 1.250357 0.588068
C  -1.884668 -0.214543 0.142224
C  -0.748421 -0.751444 -0.779787
H  2.249579 0.205292 1.847959
H  1.020089 -0.615524 0.808635
H  0.749993 1.667102 -0.431806
H  1.625174 2.411434 0.942235
H  -0.289874 0.846012 2.285158
H  -0.482651 2.556317 1.879374
H  1.420098 -0.079274 -1.830553
H  2.557431 1.326685 -1.718125
H  3.17952 -0.266405 -2.284905
H  3.995334 1.604007 0.25634
H  4.498344 0.133559 1.16845
H  4.908796 0.295905 -0.579659
H  3.807211 -1.979794 -0.803087
H  3.215446 -1.979066 0.906666
H  2.009595 -2.092794 -0.444603
H  -2.514057 1.55701 1.169059
H  -1.601396 1.876662 -0.327354
H  -1.951467 -0.870498 1.03028
H  -3.548468 -1.194715 -0.6779
H  -3.100101 0.213527 -1.476694
