program: Gaussian 09
title: 000114991
version: EM64L-G09RevD.01
frameworkgroup: C1[X(C10H2Cl6)]
method: RPBEPBE
basis: SDD
operation: Freq
keyword: #pfreq=noraman
keyword: PBEPBE/SDD
title: #p freq=noraman PBEPBE/SDD
converged: NO YES NO YES
title: Mulliken charges:
elementType: Cl Cl Cl Cl Cl Cl C C C C C C C C C C H H
charge: 0.055970 0.055957 0.005882 0.005869 0.071721 0.071735 0.698544 0.698456 -0.424111 -0.423993 -0.381488 -0.381383 -0.088586 -0.088548 -0.212014 -0.211936 0.273965 0.273961
chargesum: 0.00000
title: Mulliken charges with hydrogens summed into heavy atoms:
elementType: Cl Cl Cl Cl Cl Cl C C C C C C C C C C
charge: 0.055970 0.055957 0.005882 0.005869 0.071721 0.071735 0.698544 0.698456 -0.424111 -0.423993 -0.381488 -0.381383 -0.088586 -0.088548 0.061951 0.062025
polarizability: 2.37746553e+02 -1.04764501e-03 2.35369989e+02 -4.95491866e-04 -2.51631713e-03 5.70840913e+01
1716.lowfreq: -27.5403 -23.4855 -6.2677 0.0011 0.0016 0.0017 3.3529 6.7190 60.7848
frequency: -27.5255 -23.4533 60.7848 67.5154 155.5380 182.6956 206.3630 222.9699 225.4709 265.4464 270.1574 286.2147 305.4966 307.2268 312.3767 338.6566 339.1060 377.2818 459.9447 525.0880 532.7160 568.0155 623.9097 634.2610 660.6315 664.9460 675.1856 780.8946 783.4633 827.5018 850.1342 930.2573 947.0340 972.7575 1140.4300 1159.1307 1207.6288 1255.8157 1266.4855 1325.3480 1342.1734 1390.7286 1463.6708 1533.8093 1565.4105 1581.7798 3173.0877 3190.5631
redmass: 30.6113 27.7005 8.2250 34.3425 10.9786 31.0531 24.3127 22.0734 32.5012 31.3874 33.6457 7.8030 29.2754 8.1052 25.6275 26.9720 7.8746 13.7571 6.9402 7.4839 4.7687 12.8190 10.5537 10.2359 10.9161 10.9040 8.7030 11.6578 11.3257 1.2950 9.0016 9.5679 1.3647 10.5786 2.1642 3.1955 2.8034 10.2965 3.4552 11.9779 3.9984 2.6768 7.7983 10.2212 8.7088 7.4589 1.0896 1.0982
irintensity: 0.0003 0.1334 1.0910 0.0000 0.9456 0.6339 0.2365 0.0107 0.0025 0.3762 0.0065 0.0000 0.0539 0.5327 0.1130 0.2782 0.0005 7.2090 2.4451 5.0659 0.0000 58.0297 5.7284 8.5954 16.4911 53.3420 0.0000 0.0000 0.0199 42.2097 4.2967 4.1454 0.0000 16.8894 4.8760 144.7132 59.9471 3.8241 138.0381 63.7077 5.5078 5.3298 0.4763 64.9041 4.4882 11.9178 0.4812 0.0035
temp: 298.150 k
press: 1.00000 atm
elementType: 17 17 17 17 17 17 6 6 6 6 6 6 6 6 6 6 1 1
symmnumber: 1
zpe: 227027.9 jmol-1
zpe.correction: 0.086470 hartree
zpe.thermalcorrener: 0.099481 hartree
zpe.thermalcorrenthalpy: 0.100425 hartree
zpe.thermalcorrgfe: 0.045631 hartree
zpe.sumelectzpe: -3141.474359 hartree
zpe.sumelectthermal: -3141.461348 hartree
zpe.sumelectthermalent: -3141.460404 hartree
zpe.sumelectthermalfe: -3141.515199 hartree
dipole: 0.0001 -2.3207 0.0002
dipole: 2.3207
quadrupole: -137.9851 -122.3435 -133.6065
quadrupole: -0.0017 -0.0006 -0.0007
quadrupole: -6.6734 8.9682 -2.2948 -0.0017 -0.0006 -0.0007
hfenergy: -3141.5608296 hartree
pointgroup: C01 [X(C10H2Cl6)]
dipole: 0.9130332 0.000228 -0.0000921 debye
dipolederiv: -0.0423961 0.0662361 -0.0000379 0.0955815 -0.6507326 0.0004034 -0.0001147 0.0005239 0.0167157 -0.0423988 -0.0664602 0.0000141 -0.0956275 -0.6507763 0.000124 0.0000717 0.0001242 0.0167119 -0.1193589 -0.1498235 -0.0000746 -0.2248761 -0.7077505 -0.0004261 -0.0001799 -0.0005198 -0.0220548 -0.1195827 0.1502647 0.0000369 0.2251649 -0.7076492 -0.0001793 0.0000942 -0.0001712 -0.0220628 -0.5936846 0.2400998 -0.0000597 0.3226147 -0.120144 0.0000277 -0.0001521 0.0000709 0.0178921 -0.5936096 -0.2401457 0.000153 -0.3226707 -0.1202091 0.0000905 0.0002032 0.0000542 0.017894 0.1543969 -0.0131749 0.0000994 -0.0751251 -0.4080422 -0.000009 0.0003806 -0.0000457 0.1203805 0.154769 0.0132781 -0.0001129 0.0752282 -0.4079302 -0.0000482 -0.0002984 -0.0000158 0.1204277 -0.1881242 0.0737417 0.0000359 -0.1040147 0.9223779 -0.0007892 0.000054 -0.0007795 -0.0848367 -0.1882498 -0.0735497 0.000011 0.104159 0.922439 -0.0001386 -0.0000014 -0.0000611 -0.0848413 -0.0154943 0.0887685 0.0000526 0.4464255 1.051301 0.0008693 0.0002302 0.0008485 -0.1030546 -0.0153814 -0.0893461 -0.0000534 -0.4469668 1.0512043 0.0002889 -0.0001037 0.0001721 -0.1030592 0.7486901 -0.5619589 0.0001746 -0.4552253 0.0263612 0.0001481 0.0002624 0.0001001 -0.0211165 0.7485619 0.5619504 -0.0002864 0.4551954 0.0265142 -0.000136 -0.0003804 -0.0001482 -0.0211583 0.0324728 0.1121616 0.0000594 -0.1387172 -0.1654362 -0.0001494 -0.0000363 -0.0001272 -0.0879738 0.0324557 -0.1120291 -0.0000136 0.1388634 -0.1653577 0.0000063 0.0000145 0.0000998 -0.0879783 0.0234816 -0.0419236 -0.0000184 -0.0477237 0.0519053 -0.0000398 -0.0000618 -0.0000994 0.1640612 0.0234525 0.041911 0.0000202 0.0477145 0.0519253 -0.0000423 0.0000178 -0.0000261 0.1640533 unknown
polarizability: 235.3699897|-0.0017756|237.7465519|-0.0025162|-0.0004963|57.0840913 unknown
InChI: InChI=1S/C10H2Cl6/c11-3-1-2-4(12)6-5(3)7(13)9(15)10(16)8(6)14/h1-2H
charge 0 multiplicity 1
18 atoms
Cl -0.967621 3.218686 -0.001549
Cl -0.967797 -3.218932 0.000495
Cl 2.055143 3.212769 0.001608
Cl 2.056593 -3.212363 -0.00069
Cl -3.580953 1.572571 -0.000344
Cl -3.580746 -1.57313 0.000794
C  0.488259 0.745177 0.00001
C  0.488414 -0.745359 -0.000031
C  -0.793177 1.418173 -0.000331
C  -0.793037 -1.418454 0.00021
C  1.77398 1.409372 0.000365
C  1.774425 -1.409124 -0.000294
C  -2.000531 0.710865 -0.000075
C  -2.000438 -0.711219 0.000313
C  2.974854 0.70476 0.000127
C  2.975061 -0.70408 -0.000317
H  3.922095 1.248626 0.000365
H  3.922477 -1.24764 -0.000554
