program: Gaussian 09
title: 000114926
version: EM64L-G09RevD.01
frameworkgroup: C1[X(C5H7N5O)]
method: RPBEPBE
basis: SDD
operation: Freq
keyword: #pfreq=noraman
keyword: PBEPBE/SDD
title: #p freq=noraman PBEPBE/SDD
converged: NO YES NO NO
title: Mulliken charges:
elementType: O N N N N N C C C C C H H H H H H H
charge: -0.235423 -0.431416 -0.070445 -0.070503 -0.622164 -0.622332 0.065798 0.172660 0.172845 -0.354199 -0.095226 0.319831 0.243039 0.337596 0.330156 0.337626 0.330191 0.191966
chargesum: 0.00000
title: Mulliken charges with hydrogens summed into heavy atoms:
elementType: O N N N N N C C C C C
charge: -0.235423 -0.111585 -0.070445 -0.070503 0.045588 0.045484 0.065798 0.172660 0.172845 -0.111160 0.096740
polarizability: 1.20404149e+02 6.03657181e-02 1.07841960e+02 4.53039292e+00 -2.08999869e-02 5.00525743e+01
1716.lowfreq: -12.1463 0.0008 0.0008 0.0009 6.7475 8.6859 48.6778 90.5887 152.6338
frequency: 48.6476 90.5885 152.6337 154.3871 213.8018 286.1908 294.2832 368.9859 414.8423 466.2900 476.4886 505.0181 525.9043 537.0995 545.7411 551.8339 592.2057 670.5265 681.2751 757.1286 798.5045 868.6145 950.5394 958.9144 967.1570 994.1280 1140.8262 1170.5532 1228.4096 1301.8664 1301.9194 1338.7159 1341.5636 1397.9981 1433.2777 1492.9789 1545.5661 1558.8871 1611.3778 1612.3755 1648.0963 2953.9426 3155.3739 3458.5669 3547.1237 3548.9286 3700.7339 3700.9798
redmass: 6.0946 5.2620 2.0988 5.2515 7.3199 3.4531 4.3648 3.6571 5.9710 1.2035 1.1381 2.8564 3.0395 8.8091 1.0709 1.2652 5.5973 2.5512 2.1889 6.1292 8.8053 8.6651 1.4444 2.3802 1.9137 1.4987 2.7223 4.4840 3.4376 3.9096 4.7618 1.2519 1.7591 1.6701 2.4053 3.6796 5.9942 2.7101 1.7188 1.5674 4.3331 1.0882 1.0921 1.0751 1.0442 1.0447 1.1049 1.1049
irintensity: 4.4554 7.3886 1.2633 0.6145 0.0809 7.3212 3.1151 39.7825 4.2437 1.4133 390.8571 1.9982 58.2308 3.3133 0.8133 80.4112 12.3321 41.7719 58.8027 34.1390 10.0712 20.8470 9.2861 17.8237 6.4237 5.1530 19.1603 37.1852 106.0117 80.0387 59.6811 37.8608 25.5719 1.1560 8.6372 114.1000 10.8993 180.8890 763.2298 21.0306 454.8066 55.7230 24.1682 18.3565 173.3149 8.4797 19.1487 73.9693
temp: 298.150 k
press: 1.00000 atm
elementType: 8 7 7 7 7 7 6 6 6 6 6 1 1 1 1 1 1 1
symmnumber: 1
zpe: 353268.0 jmol-1
zpe.correction: 0.134553 hartree
zpe.thermalcorrener: 0.144728 hartree
zpe.thermalcorrenthalpy: 0.145673 hartree
zpe.thermalcorrgfe: 0.098722 hartree
zpe.sumelectzpe: -542.931799 hartree
zpe.sumelectthermal: -542.921624 hartree
zpe.sumelectthermalent: -542.920680 hartree
zpe.sumelectthermalfe: -542.967630 hartree
dipole: -0.0675 0.0125 -1.2905
dipole: 1.2923
quadrupole: -86.3969 -50.4662 -63.0190
quadrupole: 0.0602 2.9010 -0.0171
quadrupole: -19.7695 16.1611 3.6084 0.0602 2.9010 -0.0171
hfenergy: -543.0663521 hartree
pointgroup: C01 [X(C5H7N5O1)]
dipole: -0.0172998 0.0947019 -0.4992442 debye
dipolederiv: -1.3811341 0.1921567 0.2016949 0.2383423 -0.3949467 -0.0258747 -0.0715414 0.0338046 -0.4522868 -0.9320834 0.0742712 0.202393 -0.0215723 -0.4179099 -0.0537721 0.7380637 -0.172626 -0.3685646 -0.7332199 0.4663283 -0.0097315 0.0625917 -0.986806 -0.0740346 -0.0901034 -0.0106124 -0.2509473 -0.9688825 -0.4389304 -0.1795327 -0.0269541 -0.7182528 -0.0888945 -0.145191 -0.1420754 -0.284116 -0.2462422 0.2796319 0.1186167 0.0824495 -1.4163784 -0.0422592 0.0937583 -0.0013233 -0.6578101 -0.5988563 -0.6608421 -0.0866399 -0.4637375 -0.9945212 -0.1630621 -0.0623238 -0.205047 -0.7261448 0.2979651 -0.2509527 -0.0042729 -0.2716403 -0.7502292 -0.1142431 0.1235863 -0.1422421 -0.1614656 0.5272658 -0.2489627 0.0452542 -0.048031 1.6958253 0.1356449 0.0364608 0.1383063 0.2221076 0.8389537 0.6031911 0.2348884 0.4156627 1.3259678 0.2626477 0.1617444 0.2780439 0.2787641 0.6746771 0.0571372 0.1351949 0.0560824 0.9972058 0.1472818 0.1426398 0.1455824 0.0059287 1.8284397 -0.3151577 -0.3344971 -0.2512768 0.18876 -0.0473147 -0.6852392 0.0305936 0.8159982 0.0440646 0.0604548 -0.0162184 0.0609938 0.2857823 0.0324192 -0.0203399 0.0340204 0.1348857 -0.0915005 0.0457541 -0.0321225 0.0459956 0.0780401 0.0031618 -0.0336471 0.0036257 0.1119703 0.1846021 0.0372421 -0.0333144 0.0310865 0.2781762 -0.0124237 -0.0325778 -0.0165298 0.3664878 0.1692982 -0.0434795 -0.0436624 0.0291467 0.2488132 -0.0296127 -0.0256755 -0.0415978 0.3454886 0.1793019 0.0195217 -0.0342067 0.0249148 0.2786134 -0.0018887 -0.0296208 0.0015783 0.371309 0.1912338 0.0760286 -0.0148395 0.0011266 0.2111791 0.0005534 -0.0176391 0.0096373 0.3605371 0.0161168 0.0466075 -0.1490041 0.0348193 0.0906811 0.0716712 -0.0823541 0.0568614 -0.112142 unknown
polarizability: 119.7198654|-3.3986218|107.1040928|4.9709613|8.5750334|51.4747255 unknown
InChI: InChI=1S/C5H7N5O/c6-4-3(10-2-11)5(7)9-1-8-4/h1-2,10H,6-7H2
charge 0 multiplicity 1
18 atoms
O  -3.644278 0.765447 0.354708
N  -1.46529 0.43006 -0.44971
N  2.207896 0.744879 0.334864
N  1.68302 -1.607331 -0.070801
N  0.559111 2.403897 0.220346
N  -0.491471 -2.304139 -0.59123
C  -0.089505 0.081467 -0.208544
C  0.884257 1.072619 0.11427
C  0.361503 -1.269353 -0.288963
C  2.516004 -0.574612 0.225147
C  -2.438053 0.467356 0.551939
H  -1.778494 0.663598 -1.400718
H  3.565085 -0.837963 0.395813
H  1.301955 3.056145 0.462277
H  -0.395912 2.729577 0.097238
H  -0.104132 -3.244788 -0.62254
H  -1.484268 -2.147886 -0.743391
H  -2.018125 0.201525 1.547895
