program: Gaussian 09
title: 000114841
version: EM64L-G09RevD.01
frameworkgroup: C1[X(C10H4Cl4)]
method: RPBEPBE
basis: SDD
operation: Freq
keyword: #pfreq=noraman
keyword: PBEPBE/SDD
title: #p freq=noraman PBEPBE/SDD
converged: NO NO NO NO
title: Mulliken charges:
elementType: Cl Cl Cl Cl C C C C C C C C C C H H H H
charge: 0.039363 -0.022925 -0.013470 0.013390 0.632659 0.539955 -0.348753 -0.374539 -0.324007 -0.416167 -0.088088 -0.257683 -0.223577 -0.230877 0.272150 0.291664 0.265338 0.245566
chargesum: 0.00000
title: Mulliken charges with hydrogens summed into heavy atoms:
elementType: Cl Cl Cl Cl C C C C C C C C C C
charge: 0.039363 -0.022925 -0.013470 0.013390 0.632659 0.539955 -0.348753 -0.374539 -0.324007 -0.144017 -0.088088 0.033981 0.041761 0.014689
polarizability: 1.95324326e+02 -1.73605604e+00 2.04395341e+02 -6.19271125e-03 -8.35348921e-03 5.14191101e+01
1716.lowfreq: -3.1653 -0.0033 -0.0011 -0.0009 2.4263 8.7698 21.0546 57.4821 128.5594
frequency: 20.8672 57.4733 128.5580 178.7399 179.9178 199.3764 230.9078 241.9678 250.3271 306.5664 335.6545 339.4706 397.8064 465.7919 477.2975 511.3958 545.5845 556.0444 609.2671 631.6609 652.2927 739.0727 752.0111 811.0618 817.0934 868.0356 896.0655 917.2758 969.2888 985.4175 1089.6981 1146.7622 1163.3080 1196.2350 1215.4740 1291.8598 1331.3427 1367.3496 1400.0246 1415.8998 1492.2821 1552.3042 1587.0225 1611.3885 3154.7476 3171.9351 3184.1866 3187.2668
redmass: 17.2771 13.3818 9.7198 4.4191 29.0532 19.4837 19.2914 5.4029 24.9556 24.7067 8.3118 12.7129 9.7041 4.5338 8.6856 4.2231 8.2378 6.5561 6.2968 4.4655 9.3576 8.9320 2.5527 1.8746 7.2165 1.4039 7.9580 1.3934 8.5060 1.3418 2.3358 2.1551 1.8121 1.5039 2.7593 2.9707 4.1237 4.6013 2.8992 2.7196 4.7578 8.2600 8.2646 6.8086 1.0871 1.0921 1.0998 1.0940
irintensity: 0.1009 0.5522 0.0760 0.0804 0.2915 0.6699 0.2322 5.1007 0.1305 0.2032 0.0027 3.7726 3.1544 0.8647 8.7815 0.2641 19.8773 2.2248 0.4104 8.1476 29.1082 54.9466 27.6591 46.4087 25.5630 22.0126 7.2185 0.1546 7.5277 0.8209 0.4757 81.9260 28.3157 44.8200 12.5287 62.6723 10.3356 21.3714 26.2963 16.9207 15.9467 40.2282 35.3103 2.0592 4.6995 0.3258 6.8611 3.4467
temp: 298.150 k
press: 1.00000 atm
elementType: 17 17 17 17 6 6 6 6 6 6 6 6 6 6 1 1 1 1
symmnumber: 1
zpe: 278917.6 jmol-1
zpe.correction: 0.106234 hartree
zpe.thermalcorrener: 0.118450 hartree
zpe.thermalcorrenthalpy: 0.119394 hartree
zpe.thermalcorrgfe: 0.065571 hartree
zpe.sumelectzpe: -2222.729480 hartree
zpe.sumelectthermal: -2222.717264 hartree
zpe.sumelectthermalent: -2222.716320 hartree
zpe.sumelectthermalfe: -2222.770143 hartree
dipole: 1.2071 -2.5956 0.0003
dipole: 2.8626
quadrupole: -109.0718 -97.8350 -110.4391
quadrupole: 3.2579 -0.0007 -0.0023
quadrupole: -3.2898 7.9470 -4.6572 3.2579 -0.0007 -0.0023
hfenergy: -2222.8357139 hartree
pointgroup: C01 [X(C10H4Cl4)]
dipole: 0.6901193 0.8900063 0.0001109 debye
dipolederiv: -0.0395989 -0.0523208 0.0000066 -0.1161188 -0.6547698 0.0001369 0.0000368 0.0001798 0.0083679 -0.1192078 0.0510818 -0.0000089 0.0994596 -0.7955042 0.0000627 -0.0000276 0.000046 -0.0446004 -0.1508584 0.1716794 0.0000275 0.2481779 -0.6709766 -0.000149 0.0000679 -0.0001756 -0.0355656 -0.6956202 -0.2289006 -0.0000183 -0.3041397 -0.1600451 -0.0000064 0.0000236 0.0000147 -0.0222833 0.1765091 0.0930844 -0.0000235 0.0916775 -0.4076841 -0.0000116 -0.0000963 -0.0000118 0.1188053 0.0179691 0.0637976 0.0000414 0.1161441 -0.2931597 0.0000346 0.0000806 0.0000326 0.0628472 -0.2530874 -0.0606999 -0.000022 0.1003943 0.9249597 -0.00027 -0.0000152 -0.0002863 -0.0938349 0.1790043 -0.0725609 0.0000325 -0.2315358 1.1907636 -0.0001017 0.0000587 -0.0000516 -0.0883386 0.0654344 -0.1316392 -0.0000228 -0.4771191 1.0214496 0.0003136 -0.0000999 0.0003135 -0.0920837 -0.1301977 -0.0401382 0.0000129 0.0409098 -0.0281242 -0.0000083 -0.0000072 -0.0000251 -0.1497582 1.0166561 0.3820126 0.0000265 0.4197458 0.118536 0.0000437 -0.0000426 0.0000441 -0.0406957 -0.2684314 -0.1447951 -0.0000053 -0.0696289 -0.2869885 0.0000096 0.0000226 -0.000016 -0.0506472 -0.015213 -0.1552941 -0.0000144 0.0637555 -0.2352796 -0.0000719 0.0000142 -0.0000894 -0.0913192 0.0964288 0.0918291 0.0000374 0.0309098 0.1166437 0.0000416 0.0000601 0.000069 -0.1394631 0.1088663 0.02878 -0.0000083 -0.0238344 -0.005258 -0.000006 -0.0000274 -0.0000043 0.1651333 0.0551048 0.0330079 -0.0000146 0.0217749 0.07465 0.0000145 -0.00002 0.0000044 0.170236 -0.0023003 0.0510982 -0.0000096 0.0645997 0.0644045 -0.0000055 0.0000099 -0.0000302 0.1609853 -0.0414578 -0.0800223 -0.0000372 -0.0751724 0.0263829 -0.0000267 -0.0000383 -0.0000138 0.1622149 unknown
polarizability: 201.0771836|4.701359|198.6424833|0.0102624|-0.0016772|51.4191101 unknown
InChI: InChI=1S/C10H4Cl4/c11-6-3-1-2-5-7(12)4-8(13)10(14)9(5)6/h1-4H
charge 0 multiplicity 1
18 atoms
Cl -1.004798 -2.95445 0.000514
Cl -1.03884 3.493801 -0.000256
Cl 2.082621 -2.801838 -0.000395
Cl -3.684007 -1.286152 -0.000072
C  0.392652 -0.442298 0.000063
C  0.34719 1.028222 0.00005
C  -0.872789 -1.148983 0.000084
C  -0.934133 1.674714 -0.000136
C  1.72255 -1.011869 0.000082
C  1.547301 1.804994 0.000251
C  -2.082325 -0.442164 -0.000102
C  -2.129462 0.976415 -0.000248
C  2.877762 -0.225655 0.00031
C  2.795957 1.191654 0.000436
H  1.460837 2.894282 0.000254
H  -3.092831 1.490685 -0.000406
H  3.852829 -0.720606 0.000336
H  3.714085 1.786251 0.000636
