program: Gaussian 09
title: 000114838
version: EM64L-G09RevD.01
frameworkgroup: C1[X(C10H4Cl4)]
method: RPBEPBE
basis: SDD
operation: Freq
keyword: #pfreq=noraman
keyword: PBEPBE/SDD
title: #p freq=noraman PBEPBE/SDD
converged: NO YES NO YES
title: Mulliken charges:
elementType: Cl Cl Cl Cl C C C C C C C C C C H H H H
charge: -0.004122 -0.004106 -0.004122 -0.004106 0.646117 0.646197 -0.370110 -0.370198 -0.370109 -0.370198 -0.219478 -0.219539 -0.219480 -0.219538 0.270696 0.270699 0.270697 0.270699
chargesum: 0.00000
title: Mulliken charges with hydrogens summed into heavy atoms:
elementType: Cl Cl Cl Cl C C C C C C C C C C
charge: -0.004122 -0.004106 -0.004122 -0.004106 0.646117 0.646197 -0.370110 -0.370198 -0.370109 -0.370198 0.051219 0.051160 0.051217 0.051161
polarizability: 2.23729643e+02 2.12303627e-05 1.76247375e+02 -1.69038458e-03 -3.05641588e-04 5.16237706e+01
1716.lowfreq: -12.1050 -5.4285 0.0011 0.0025 0.0030 3.7425 7.1696 26.2219 79.6811
frequency: -12.0916 26.2219 79.6811 208.6006 214.8306 218.6332 221.1826 238.6342 286.4385 301.0759 304.2190 312.4991 408.8035 468.8650 484.5286 519.3237 532.7298 584.3774 585.7502 619.2138 625.2575 748.6073 759.5954 767.3181 824.8265 828.4002 910.1676 942.6836 945.7520 959.3508 1121.3705 1147.3318 1149.6872 1190.4646 1211.2117 1244.5444 1341.2644 1343.4000 1369.0139 1422.1142 1508.0827 1577.9883 1578.0700 1593.9082 3170.7367 3170.8332 3188.2720 3188.4207
redmass: 28.5564 9.9576 8.5527 5.4120 27.9623 13.3750 19.1579 34.0910 8.4401 5.3992 29.4316 28.8030 6.7179 3.5168 4.9544 6.7450 8.0533 10.1650 9.3526 4.2527 7.9983 8.9581 10.1566 6.1245 1.3015 1.2888 7.6904 1.3659 1.3651 9.1544 2.9202 1.5219 3.3368 1.7947 1.6449 8.2839 1.7565 7.2695 2.9466 2.5829 5.8436 8.8644 6.3753 8.6029 1.0895 1.0896 1.0981 1.0979
irintensity: 0.0000 0.0000 1.8906 6.2798 1.5724 2.1093 0.0001 0.0001 0.0000 0.0000 0.0275 0.0000 0.0000 0.0000 0.0000 41.7148 0.0000 40.8559 0.0000 0.0000 17.7198 37.1922 0.0000 3.2659 0.0000 86.3419 0.0000 0.0000 0.0000 0.0000 0.0702 0.0009 227.8633 0.0000 12.7245 0.0000 129.3176 5.6082 0.0002 0.0000 5.1595 0.8410 50.4927 0.0000 1.8494 0.0000 0.2919 0.0000
temp: 298.150 k
press: 1.00000 atm
elementType: 17 17 17 17 6 6 6 6 6 6 6 6 6 6 1 1 1 1
symmnumber: 1
zpe: 277798.5 jmol-1
zpe.correction: 0.105808 hartree
zpe.thermalcorrener: 0.117217 hartree
zpe.thermalcorrenthalpy: 0.118161 hartree
zpe.thermalcorrgfe: 0.066576 hartree
zpe.sumelectzpe: -2222.718294 hartree
zpe.sumelectthermal: -2222.706885 hartree
zpe.sumelectthermalent: -2222.705941 hartree
zpe.sumelectthermalfe: -2222.757526 hartree
dipole: 0.0005 0.0000 0.0000
dipole: 0.0005
quadrupole: -117.8129 -91.7096 -110.4659
quadrupole: 0.0000 0.0001 -0.0006
quadrupole: -11.1501 14.9532 -3.8031 0.0000 0.0001 -0.0006
hfenergy: -2222.8241019 hartree
pointgroup: C01 [X(C10H4Cl4)]
dipole: -0.0001853 -0.0000001 -0.0000192 debye
dipolederiv: -0.7289849 0.1855952 -0.0002196 0.140926 -0.1194728 0.0000368 -0.0002611 0.0000804 -0.0292677 -0.7290332 -0.1853855 -0.0001473 -0.1405902 -0.119349 -0.0000276 -0.0001696 -0.0000646 -0.0292589 -0.729018 -0.1855324 0.0002294 -0.1408634 -0.1194391 0.0000401 0.0002775 0.0000866 -0.029268 -0.7289998 0.1854487 0.0001655 0.1406528 -0.1193826 -0.0000303 0.0001847 -0.0000668 -0.0292589 -0.4460103 0.000029 0.0000032 0.0000294 0.1247021 -0.0000649 0.0000068 -0.0001614 0.1121442 -0.446093 0.0000295 0.0000079 0.0000289 0.1243494 0.0000668 0.0000063 0.000155 0.1121075 1.0688747 -0.3437164 0.0004344 -0.0552465 0.0062116 -0.0000348 0.0004008 -0.0001036 -0.0979547 1.0689152 0.3433195 0.0002676 0.0547986 0.0062068 0.000042 0.000219 0.0000702 -0.0979504 1.0689155 0.3436079 -0.0004496 0.0551377 0.0061697 -0.0000398 -0.0004255 -0.0001065 -0.097954 1.0688747 -0.343428 -0.0002998 -0.0549071 0.0062476 0.000039 -0.0002475 0.0000772 -0.0979506 -0.1659997 0.1128633 -0.0000681 -0.1246866 0.0322657 -0.0000236 -0.0000457 0.0000114 -0.0929293 -0.1660907 -0.1127515 -0.0000213 0.1247994 0.0322647 0.0000167 0.0000261 0.0000011 -0.0929266 -0.1659977 -0.1128446 0.000066 0.1247055 0.0322629 -0.0000291 0.0000423 0.0000096 -0.0929299 -0.166093 0.1127705 0.0000273 -0.1247788 0.0322682 0.0000165 -0.0000185 -0.0000045 -0.0929262 0.0491912 0.0534481 -0.0000239 0.0464064 0.0186629 0.000009 -0.0000472 0.000032 0.1640771 0.0491788 -0.0534554 -0.0000267 -0.0464142 0.0186845 -0.0000159 -0.0000289 -0.000026 0.1640846 0.0491812 -0.0534507 0.0000272 -0.0464092 0.0186742 0.0000128 0.0000493 0.000035 0.1640774 0.0491889 0.0534526 0.0000279 0.0464112 0.0186734 -0.0000137 0.0000312 -0.000025 0.1640844 unknown
polarizability: 223.7296425|-0.0024596|176.2473748|-0.0016904|0.0003057|51.6237706 unknown
InChI: InChI=1S/C10H4Cl4/c11-5-1-2-6(12)10-8(14)4-3-7(13)9(5)10/h1-4H
charge 0 multiplicity 1
18 atoms
Cl 3.21563 -1.532544 0.00079
Cl -3.215782 -1.531511 -0.000566
Cl 3.215788 1.532191 -0.000867
Cl -3.215625 1.531819 0.000616
C  0.747692 -0.000049 -0.000008
C  -0.747461 0.000027 0.000002
C  1.407338 -1.285236 0.000176
C  -1.407384 -1.284954 -0.000186
C  1.40747 1.285068 -0.000219
C  -1.407252 1.285076 0.000192
C  0.705903 -2.487435 0.000059
C  -0.706238 -2.487308 -0.000197
C  0.706159 2.487341 -0.00012
C  -0.705982 2.487358 0.000164
H  1.250809 -3.434336 0.000184
H  -1.25134 -3.434094 -0.000366
H  1.251162 3.434185 -0.000278
H  -1.250987 3.434201 0.000322
