program: Gaussian 09
title: 000114681
version: EM64L-G09RevD.01
frameworkgroup: C1[X(C8H11NO)]
method: RPBEPBE
basis: SDD
operation: Freq
keyword: #p
keyword: freq=noraman
keyword: PBEPBE/SDD
title: #p freq=noraman PBEPBE/SDD
converged: YES YES NO NO
title: Mulliken charges:
elementType: O N C C C C C C C C H H H H H H H H H H H
charge: -0.421790 -0.043308 0.003142 -0.510132 0.152145 0.141680 -0.672383 -0.268283 -0.274143 -0.787344 0.260357 0.191072 0.208107 0.223159 0.243985 0.255902 0.236257 0.250516 0.224932 0.225512 0.360616
chargesum: 0.00000
title: Mulliken charges with hydrogens summed into heavy atoms:
elementType: O N C C C C C C C C
charge: -0.061174 -0.043308 0.003142 -0.058702 0.152145 0.141680 0.002869 -0.012381 -0.037886 -0.086384
polarizability: 1.28650744e+02 2.67270008e-01 9.89520395e+01 -5.22386937e+00 4.37614809e+00 5.76424813e+01
1716.lowfreq: -7.9460 0.0002 0.0005 0.0005 6.7662 16.8466 31.1549 70.6032 106.4624
frequency: 30.7646 70.4341 106.4617 146.7494 201.9084 281.2770 290.7814 321.3809 325.6989 352.5319 454.0709 472.3615 479.3781 556.3324 615.0978 694.4325 733.0959 774.7285 789.0149 833.9715 895.8223 958.6942 970.6738 985.1420 1042.1561 1045.7062 1062.5970 1106.3488 1143.4827 1173.9912 1241.6576 1250.8826 1293.1757 1320.8306 1337.4813 1376.7752 1390.8607 1397.0685 1446.7178 1465.9719 1471.0073 1471.5169 1477.9183 1490.2517 1576.6395 1597.0725 2951.6767 2980.2749 2980.5678 3056.7106 3059.1968 3079.6287 3091.4223 3113.6363 3139.6269 3170.9175 3585.5169
redmass: 1.0354 2.6072 3.4062 3.9350 1.1053 3.4292 2.2189 1.4756 1.8821 3.9472 3.7830 3.5364 4.6655 4.2164 3.6048 4.7310 3.0063 4.0911 1.5297 1.4470 3.2507 1.3300 1.7661 1.9265 2.0492 1.5454 1.7718 1.5533 1.3696 2.1886 1.3845 1.9120 1.7927 2.4725 3.6324 2.3273 1.2340 1.4641 3.0972 1.0972 1.0545 1.0500 1.1131 1.0791 5.8994 6.4822 1.0694 1.0370 1.0375 1.0975 1.0939 1.0965 1.1003 1.0978 1.0900 1.0969 1.0654
irintensity: 0.3382 0.0816 0.0925 0.6449 0.1782 5.5193 2.2707 62.9397 78.6809 0.8517 16.9822 2.6474 2.5323 5.9350 2.0274 0.6682 6.2844 2.3746 6.2386 36.3006 0.6485 0.2820 8.7012 5.6489 17.1646 5.9523 6.4194 5.5305 170.8094 47.0179 17.1458 2.5828 3.5337 2.8114 1.1158 4.4380 13.9671 7.6494 188.6683 12.1594 16.9213 16.6731 5.9337 18.7501 2.0206 3.3399 43.2435 53.1205 9.9857 22.7625 5.1833 46.8143 27.5418 9.9605 12.4752 7.8364 37.0928
temp: 298.150 k
press: 1.00000 atm
elementType: 8 7 6 6 6 6 6 6 6 6 1 1 1 1 1 1 1 1 1 1 1
symmnumber: 1
zpe: 452966.5 jmol-1
zpe.correction: 0.172526 hartree
zpe.thermalcorrener: 0.182965 hartree
zpe.thermalcorrenthalpy: 0.183909 hartree
zpe.thermalcorrgfe: 0.136052 hartree
zpe.sumelectzpe: -440.670620 hartree
zpe.sumelectthermal: -440.660181 hartree
zpe.sumelectthermalent: -440.659237 hartree
zpe.sumelectthermalfe: -440.707094 hartree
dipole: 0.5682 0.0995 0.0875
dipole: 0.5834
quadrupole: -49.1045 -63.4438 -61.8955
quadrupole: -4.2663 -2.4683 0.0425
quadrupole: 9.0434 -5.2959 -3.7476 -4.2663 -2.4683 0.0425
hfenergy: -440.8431457 hartree
pointgroup: C01 [X(C8H11N1O1)]
dipole: 0.2224971 -0.0400593 -0.0397303 debye
dipolederiv: -1.0992482 0.5412368 0.0057821 0.5781845 -0.4537477 0.0704929 0.0396972 0.0752592 -0.3945086 -0.3485249 0.0817313 0.0213363 -0.0314818 -0.3251828 -0.0276532 -0.0132044 -0.0087546 -0.2374861 0.2404013 0.1212089 0.0068237 0.5703268 0.1262663 0.073663 0.1170115 0.028119 -0.0592861 -0.0565995 -0.0726142 0.0503365 -0.0737537 0.0721891 -0.0543287 0.116992 0.0141256 0.0962357 0.809023 -0.5180161 0.0104914 -0.7793493 0.1595799 -0.0646106 -0.0670442 -0.0567839 0.0893459 0.4186888 -0.2429 0.0037601 -0.4175943 0.142958 0.0001067 -0.0281304 -0.0017464 0.0080167 0.0116568 -0.0287522 0.0120998 -0.0325648 0.0588568 0.0365867 -0.0551854 -0.0294637 -0.0078178 -0.0245532 0.1924817 0.0321712 -0.0796133 0.10878 0.0347778 -0.0038106 0.0703144 -0.131911 -0.103067 -0.0122346 0.0234629 0.3198398 -0.0596974 0.0394613 0.0607644 0.0161915 -0.1378213 -0.1965408 0.1177916 -0.0068649 0.0756493 0.0006005 -0.0034508 -0.015165 -0.0032106 0.0709328 0.0824082 0.0573409 0.0581537 -0.0109181 -0.0398127 -0.0878988 0.0240247 -0.0517053 0.0270047 -0.0693725 0.0249783 -0.0984183 0.0773378 -0.0193443 0.1393208 -0.070021 0.0764936 -0.0370202 0.0863401 0.0342745 0.0420471 0.0853092 -0.0936677 -0.1182027 0.0241799 -0.0650317 0.0107512 -0.1530621 -0.1568545 -0.009137 -0.1521379 0.0138485 -0.0115859 -0.0082798 -0.0090829 0.0656094 0.0337083 0.1001784 -0.0845642 0.0500417 0.0353069 0.0858239 -0.042081 0.0672612 -0.0075554 0.0981841 0.0147033 -0.0030165 0.0068049 -0.0573391 -0.0350621 -0.0061005 -0.0384458 0.1526375 -0.0708565 -0.0849142 -0.0398585 -0.0859067 0.060811 -0.025533 -0.0415015 -0.0264555 0.1459869 0.1013311 -0.0828557 -0.0173661 0.0188434 -0.0858347 -0.0340696 0.0011506 -0.0440452 0.1063668 0.0006606 0.0421629 -0.0795105 0.0344083 0.0781114 -0.0370644 -0.1306104 0.0113228 -0.0846639 -0.0522681 0.0081634 0.0970251 -0.0273723 0.0515781 0.0777585 0.1375413 0.0347193 -0.0067812 0.2916904 -0.1371107 -0.0247536 -0.1260537 0.2257398 -0.0585318 -0.0402273 -0.0590809 0.3319639 unknown
polarizability: 128.8258134|-0.4998863|98.7498696|3.8311343|5.2409411|57.6695815 unknown
InChI: InChI=1S/C8H11NO/c1-3-7-8(10)5-4-6(2)9-7/h4-5,10H,3H2,1-2H3
charge 0 multiplicity 1
21 atoms
O  1.816964 -1.816758 0.023187
N  -0.562326 1.049355 0.266518
C  0.611239 0.348092 0.278673
C  1.889307 1.132486 0.529103
C  0.634411 -1.052921 0.026822
C  -1.741325 0.403258 0.010126
C  2.650853 1.460986 -0.785118
C  -0.574867 -1.732559 -0.234613
C  -1.77414 -0.994636 -0.2425
C  -3.004867 1.241377 0.014768
H  1.60378 2.071973 1.031276
H  2.55919 0.590638 1.231539
H  2.9367 0.548504 -1.341987
H  3.570817 2.036012 -0.574969
H  2.010384 2.067267 -1.448911
H  -0.555003 -2.809795 -0.424515
H  -2.729065 -1.49227 -0.442801
H  -2.748366 2.29034 0.229573
H  -3.522844 1.197368 -0.961811
H  -3.720995 0.889359 0.781094
H  2.600252 -1.248274 0.227746
