program: Gaussian 09
title: 000114721
version: EM64L-G09RevD.01
frameworkgroup: C1[X(C16H14O5)]
method: RPBEPBE
basis: SDD
operation: Freq
keyword: #pfreq=noraman
keyword: PBEPBE/SDD
title: #p freq=noraman PBEPBE/SDD
converged: YES YES NO NO
title: Mulliken charges:
elementType: O O O O O C C C C C C C C C C C C C C C C H H H H H H H H H H H H H H
charge: -0.220128 -0.199852 -0.432240 -0.288110 -0.218752 -0.363263 -0.104506 0.039267 0.300752 0.023941 0.119374 -0.265113 0.273786 -0.574098 0.250735 -0.543260 -0.109397 -0.523574 -0.486585 0.103191 -0.518246 0.271526 0.254650 0.248444 0.283758 0.231329 0.283900 0.264789 0.247069 0.245509 0.315324 0.370241 0.223373 0.239753 0.256412
chargesum: 0.00000
title: Mulliken charges with hydrogens summed into heavy atoms:
elementType: O O O O O C C C C C C C C C C C C C C C C
charge: -0.220128 -0.199852 -0.061999 -0.288110 -0.218752 -0.091736 0.150144 0.039267 0.300752 0.023941 0.119374 -0.016669 0.273786 -0.290340 0.250735 -0.028031 0.155392 -0.030997 -0.171261 0.103191 0.201292
polarizability: 2.98788489e+02 5.12323231e+00 1.75287878e+02 -1.01521794e+01 6.40367607e+00 1.23246517e+02
1716.lowfreq: -7.5019 -7.0141 -0.0007 -0.0003 0.0006 5.2574 28.6466 39.8253 63.1089
frequency: 28.5094 39.7652 63.0771 77.3312 80.4035 88.1948 93.9422 113.4486 139.6676 167.6713 197.7375 225.9252 236.2956 261.2941 276.8940 327.5702 331.1140 345.2022 378.0556 401.5856 456.1616 472.7651 509.6537 529.9015 535.9206 551.3816 574.6009 595.4801 609.4332 619.5606 674.5288 687.5894 703.6454 746.9227 767.9062 795.2807 816.0057 823.1638 835.7874 854.5761 861.2363 877.2863 881.0746 893.5859 906.8700 908.2057 927.2989 972.7036 989.6050 996.4941 1013.2643 1020.9441 1025.4085 1084.7453 1106.7557 1131.3629 1134.8245 1147.2133 1169.1257 1180.2249 1186.3714 1192.9325 1220.1219 1223.5945 1229.2346 1245.3416 1254.5543 1272.2572 1283.5285 1304.3584 1320.4943 1330.3402 1371.7813 1418.9586 1433.9675 1440.2603 1453.8710 1462.0772 1467.8480 1471.0560 1580.8342 1592.4645 1615.3288 1615.7376 1632.1280 2982.0064 2995.1747 2997.0454 3016.8250 3065.8781 3082.5021 3093.7555 3099.7593 3113.4761 3189.2125 3202.0737 3205.0908 3244.4274 3579.4577
redmass: 6.9146 4.0386 5.6148 4.0041 2.3054 1.7508 1.6823 3.1191 4.3759 7.8268 5.1399 6.5747 5.2528 6.2899 5.3428 2.1076 2.1351 5.3058 3.1274 5.9335 5.9879 4.6261 4.1180 2.5434 3.4595 6.7808 6.4070 5.7345 5.0104 6.6445 6.1242 3.3076 1.6563 4.3279 5.9955 5.0425 1.7452 3.9224 5.1626 1.7005 3.7755 3.8761 1.4444 8.9498 3.5465 1.4384 2.7510 3.3647 5.3067 2.0593 2.6857 5.1006 2.3350 2.7732 1.2303 1.2280 1.2061 1.6246 1.5168 2.4517 1.7088 1.1284 1.6889 1.4726 1.6419 1.4466 2.1693 2.0603 1.5659 2.5105 1.7766 2.1728 6.0167 3.6392 1.1215 1.4998 1.0727 1.1712 1.1398 2.4094 7.9318 8.1560 8.1889 8.0614 8.9219 1.0285 1.0672 1.0851 1.0626 1.0983 1.0958 1.1044 1.1052 1.0903 1.0972 1.0936 1.0889 1.1098 1.0659
irintensity: 2.6452 2.8507 0.3235 0.6491 0.7307 3.0681 2.7433 4.9087 0.1517 0.9038 0.7881 1.2437 3.3826 9.6829 11.1924 66.1126 33.2273 4.6785 20.1806 1.3179 0.6556 5.9620 0.5285 12.9602 3.9380 0.9165 17.3763 26.1948 8.1305 9.3164 6.4363 3.0024 92.1160 13.8668 22.5165 21.1134 4.0385 6.7133 1.0825 21.8208 19.3701 20.9693 5.4119 287.0297 3.3217 25.0690 27.7162 34.9493 17.7254 2.7264 43.9631 80.3274 44.1434 117.3686 1.7786 21.6292 0.4737 28.9192 62.7818 55.2858 185.5496 4.1046 24.4108 29.2242 15.8298 6.3338 10.1047 57.6058 15.7549 38.0028 27.5859 23.1295 38.8406 23.9959 19.7611 10.8918 6.6868 70.8910 26.8240 37.0798 281.8044 60.9543 368.4983 195.6734 113.5591 54.7474 17.5313 17.8320 15.6484 2.8491 9.9553 24.0037 28.3429 29.3037 1.1037 0.3358 0.1252 3.3637 23.9670
temp: 298.150 k
press: 1.00000 atm
elementType: 8 8 8 8 8 6 6 6 6 6 6 6 6 6 6 6 6 6 6 6 6 1 1 1 1 1 1 1 1 1 1 1 1 1 1
symmnumber: 1
zpe: 692328.6 jmol-1
zpe.correction: 0.263694 hartree
zpe.thermalcorrener: 0.282235 hartree
zpe.thermalcorrenthalpy: 0.283179 hartree
zpe.thermalcorrgfe: 0.215935 hartree
zpe.sumelectzpe: -992.648376 hartree
zpe.sumelectthermal: -992.629835 hartree
zpe.sumelectthermalent: -992.628891 hartree
zpe.sumelectthermalfe: -992.696134 hartree
dipole: 4.4857 -2.6661 -4.6698
dipole: 7.0026
quadrupole: -147.9169 -112.5197 -120.1496
quadrupole: -16.1998 13.0281 -2.4688
quadrupole: -21.0549 14.3424 6.7125 -16.1998 13.0281 -2.4688
hfenergy: -992.9120697 hartree
pointgroup: C01 [X(C16H14O5)]
dipole: 1.5927975 -0.6507971 -2.1516653 debye
polarizability: 297.5019411|1.4135947|168.4350769|-18.5679406|18.6706818|131.3858661 unknown
InChI: InChI=1S/C16H14O5/c1-19-11-7-12-14(10-4-5-20-16(10)21-12)15(18)13(11)8-2-3-9(17)6-8/h4-7,10,16,18H,2-3H2,1H3
charge 0 multiplicity 1
35 atoms
O  3.350156 1.359889 0.163137
O  4.94433 -0.442043 0.447134
O  -0.061729 -1.76132 -1.070215
O  -1.256323 2.485838 1.149981
O  -5.314702 -0.595304 1.702021
C  2.908876 -0.844542 -0.866802
C  4.021879 0.212787 -0.495474
C  1.634499 -0.122625 -0.445114
C  1.965835 1.094749 0.18068
C  0.289358 -0.513575 -0.516558
C  -0.755349 0.304071 0.029747
C  3.292099 -2.033586 0.021828
C  -2.150868 -0.176783 0.103079
C  1.004044 1.963663 0.701268
C  -0.350591 1.560868 0.606305
C  -2.855501 -0.940628 -1.024592
C  4.401785 -1.720507 0.732861
C  -4.289402 -1.197179 -0.498336
C  -2.994135 0.001599 1.177577
C  -4.321378 -0.587855 0.919246
C  -2.409005 2.94043 0.343161
H  2.930932 -1.095045 -1.944372
H  4.634635 0.626215 -1.308434
H  2.731504 -2.964302 0.104831
H  1.254445 2.927316 1.146587
H  -2.844533 -0.340315 -1.9551
H  -2.311444 -1.870737 -1.254574
H  4.96293 -2.281766 1.4784
H  -4.541916 -2.271124 -0.439643
H  -5.068546 -0.719524 -1.119417
H  -2.739409 0.49797 2.116286
H  0.749951 -2.265422 -1.326905
H  -2.323251 2.604542 -0.705793
H  -2.395991 4.042057 0.39155
H  -3.345087 2.552783 0.778252
