program: Gaussian 09
title: 000114454
version: EM64L-G09RevD.01
frameworkgroup: C1[X(C11H20O)]
method: RPBEPBE
basis: SDD
operation: Freq
keyword: #pfreq=noraman
keyword: PBEPBE/SDD
title: #p freq=noraman PBEPBE/SDD
converged: YES YES NO NO
title: Mulliken charges:
elementType: O C C C C C C C C C C C H H H H H H H H H H H H H H H H H H H H
charge: -0.193191 -0.120222 -0.479493 -0.446790 -0.432010 -0.500050 0.102526 -0.378985 -0.373304 -0.353810 -0.356662 -0.696286 0.244272 0.234237 0.206372 0.234736 0.203610 0.212604 0.224114 0.252550 0.238193 0.188353 0.204185 0.193314 0.190212 0.186687 0.188191 0.195197 0.196472 0.215900 0.209099 0.209980
chargesum: 0.00000
title: Mulliken charges with hydrogens summed into heavy atoms:
elementType: O C C C C C C C C C C C
charge: -0.193191 0.124050 -0.038884 -0.008444 0.004708 -0.009307 0.102526 0.013553 0.010222 0.021068 0.035006 -0.061307
polarizability: 1.48128548e+02 -8.21884586e-01 1.12278216e+02 1.83078759e+00 3.02197337e-01 9.49910471e+01
1716.lowfreq: -19.4683 -2.0196 -0.0009 -0.0008 -0.0006 8.4956 25.2491 43.0903 53.7266
frequency: 24.6216 42.9032 53.5486 70.6973 89.6046 120.6175 134.0840 149.0656 199.8471 204.6654 231.8427 271.6371 357.5703 402.2122 426.5854 494.9332 539.2790 563.7890 609.6439 720.4875 730.5597 733.2051 774.8139 826.2217 851.1882 886.7199 895.5081 908.1165 933.3161 964.1706 992.3045 1004.8243 1026.1127 1033.7329 1058.6524 1068.8043 1082.7823 1103.9400 1131.1242 1150.0143 1154.1668 1177.5615 1197.1750 1200.3417 1225.7770 1242.5491 1257.1724 1268.4389 1272.0111 1282.8118 1289.5278 1291.6853 1296.4868 1303.0933 1318.8113 1332.2321 1353.2855 1355.5750 1388.3563 1428.2075 1460.0506 1462.4193 1466.5278 1470.6073 1474.6326 1477.2505 1479.9720 1482.8005 1488.4870 1652.5919 2928.5406 2950.9079 2951.5737 2958.6764 2967.5568 2970.8783 2971.3864 2984.7988 2985.8859 2986.9110 2995.9277 3001.8104 3013.5222 3030.6770 3043.7648 3065.3030 3067.7119 3067.8395 3070.5630 3079.5755
redmass: 2.5783 2.0334 3.2460 2.9403 2.4688 1.8563 2.1818 3.5439 2.1374 3.2991 1.1189 3.1366 2.2735 3.8067 2.8467 3.2583 2.4249 3.4973 2.8789 1.0660 2.0155 1.2745 1.2070 1.9708 1.4568 1.9508 1.4312 1.9959 2.1709 1.2604 1.5020 3.7337 2.0010 1.7660 2.0593 2.1221 2.0769 2.2386 2.6267 1.9476 2.0409 1.8144 1.4246 1.6291 1.3314 1.3821 1.2595 1.3832 1.2593 1.0619 1.3109 1.1583 1.1758 1.3430 1.5808 1.4563 1.5802 1.6701 1.2170 1.0805 1.0749 1.0691 1.0755 1.0827 1.0764 1.0427 1.0931 1.0837 1.0905 12.3639 1.0800 1.0589 1.0591 1.0596 1.0595 1.0594 1.0374 1.0714 1.0897 1.0664 1.0991 1.0638 1.1023 1.1034 1.1033 1.0969 1.1006 1.0970 1.0993 1.1027
irintensity: 0.5944 0.6552 0.2960 1.8536 1.4901 0.0676 0.2171 3.2302 0.1827 0.4698 0.0078 1.8341 0.3600 3.1149 0.3350 4.8416 2.8538 3.3313 1.5915 13.0916 0.5497 0.2898 2.9475 15.1126 0.4357 2.4714 3.1243 1.4124 20.4237 3.5879 2.7269 0.2230 1.7207 3.5520 0.9707 1.3150 0.3271 23.4700 1.0577 29.7003 53.2543 0.2357 5.0177 7.3906 8.3290 1.3348 3.5751 5.4374 0.6332 0.4249 0.8188 0.8773 0.8520 0.6235 4.9308 3.3992 0.0729 0.9483 11.2419 20.8210 1.0718 0.2226 1.8012 5.5298 5.8158 12.3722 5.7350 2.5337 23.3052 161.4795 8.8147 0.7574 1.0038 16.7016 32.1441 128.8615 31.2082 22.8521 8.3551 12.4890 0.8087 37.6038 0.3030 16.5254 118.6061 23.8652 96.9723 23.3411 54.3397 46.0151
temp: 298.150 k
press: 1.00000 atm
elementType: 8 6 6 6 6 6 6 6 6 6 6 6 1 1 1 1 1 1 1 1 1 1 1 1 1 1 1 1 1 1 1 1
symmnumber: 1
zpe: 750705.5 jmol-1
zpe.correction: 0.285929 hartree
zpe.thermalcorrener: 0.300050 hartree
zpe.thermalcorrenthalpy: 0.300995 hartree
zpe.thermalcorrgfe: 0.243001 hartree
zpe.sumelectzpe: -505.418737 hartree
zpe.sumelectthermal: -505.404616 hartree
zpe.sumelectthermalent: -505.403671 hartree
zpe.sumelectthermalfe: -505.461665 hartree
dipole: -0.3556 -3.1446 0.2012
dipole: 3.1711
quadrupole: -75.7030 -83.7678 -73.5921
quadrupole: -10.7892 0.8524 0.1985
quadrupole: 1.9847 -6.0802 4.0955 -10.7892 0.8524 0.1985
hfenergy: -505.7046659 hartree
pointgroup: C01 [X(C11H20O1)]
dipole: -0.1582285 1.2350134 -0.0786484 debye
polarizability: 148.0943084|1.3523943|112.3101712|-1.8646662|0.2802274|94.9933314 unknown
InChI: InChI=1S/C11H20O/c1-2-3-4-5-7-10-8-6-9-11(10)12/h10H,2-9H2,1H3
charge 0 multiplicity 1
32 atoms
O  2.956563 -2.003732 0.175591
C  1.645774 0.102909 0.367832
C  2.025181 1.503088 -0.182393
C  0.349744 -0.535436 -0.176003
C  3.565252 1.599917 0.02464
C  4.074993 0.1694 -0.278061
C  2.904119 -0.751981 0.101246
C  -0.932285 0.1926 0.285497
C  -2.223726 -0.45681 -0.260638
C  -3.511989 0.252604 0.214008
C  -4.804214 -0.386997 -0.343459
C  -6.086494 0.32254 0.142802
H  1.560709 0.169543 1.477389
H  1.481608 2.323634 0.316052
H  1.783342 1.55081 -1.26332
H  0.318099 -1.594285 0.148128
H  0.391294 -0.546928 -1.284871
H  3.787291 1.86656 1.075547
H  4.030952 2.366535 -0.617841
H  4.998261 -0.123832 0.250659
H  4.269485 0.034826 -1.361859
H  -0.967795 0.200341 1.395534
H  -0.897313 1.25495 -0.032851
H  -2.256276 -1.522427 0.048411
H  -2.19274 -0.45703 -1.37045
H  -3.475442 1.321331 -0.085396
H  -3.549288 0.242644 1.323663
H  -4.768809 -0.371587 -1.452045
H  -4.837092 -1.455947 -0.049233
H  -6.995077 -0.150905 -0.272793
H  -6.090207 1.386491 -0.161393
H  -6.163021 0.290078 1.246209
