program: Gaussian 09
title: 000114447
version: EM64L-G09RevD.01
frameworkgroup: C1[X(C7H11ClO3)]
method: RPBEPBE
basis: SDD
operation: Freq
keyword: #p
keyword: freq=noraman
keyword: PBEPBE/SDD
title: #p freq=noraman PBEPBE/SDD
converged: YES YES NO NO
title: Mulliken charges:
elementType: Cl O O O C C C C C C C H H H H H H H H H H H
charge: -0.065414 -0.250665 -0.185461 -0.250790 -0.359366 -0.451615 -0.293762 0.270361 -0.756896 0.289157 -0.752516 0.258256 0.260289 0.304399 0.247508 0.223290 0.244123 0.265464 0.255100 0.251085 0.246777 0.250675
chargesum: 0.00000
title: Mulliken charges with hydrogens summed into heavy atoms:
elementType: Cl O O O C C C C C C C
charge: -0.065414 -0.250665 -0.185461 -0.250790 0.159179 -0.147216 0.177037 0.270361 0.007791 0.289157 -0.003979
polarizability: 1.13132393e+02 8.75394421e+00 9.24774634e+01 4.57112591e+00 -1.05857871e+00 7.36825754e+01
1716.lowfreq: -8.7347 -0.0013 -0.0009 -0.0008 5.2643 10.2901 28.1130 33.7576 44.1082
frequency: 28.0549 33.6984 44.0962 48.4509 68.1509 100.2160 115.1985 145.2050 186.1211 262.2153 277.9699 307.8832 338.0194 413.8720 462.6573 496.6210 566.9587 588.9809 624.3183 634.9318 761.8590 800.9531 834.0147 953.7531 962.9546 1002.5743 1006.8106 1027.5735 1044.1096 1072.8948 1109.1816 1165.6844 1178.6580 1201.0276 1233.9995 1266.0070 1287.7176 1342.2393 1377.9489 1380.1741 1387.2774 1441.8823 1443.6638 1453.1788 1453.2668 1454.9980 1459.5793 1627.0568 1649.5114 2996.4013 3006.8596 3012.4680 3023.3107 3037.4710 3082.7025 3085.3955 3100.0897 3121.0296 3123.2804 3141.7424
redmass: 1.6371 1.8178 5.1688 7.2281 3.7748 3.5457 1.0464 4.7044 5.7967 3.7983 3.1605 3.4840 4.5078 3.3798 4.5665 3.4230 3.2827 4.2533 3.4418 3.2561 2.2930 2.0151 2.9809 3.5928 1.9902 1.9562 2.0022 1.7362 1.6529 3.1929 2.4081 1.4354 1.6079 3.5789 1.5705 1.3126 1.0992 1.4893 1.2166 1.3317 1.3103 1.0825 1.0632 1.0577 1.0665 1.0556 1.0925 9.2481 8.9645 1.0369 1.0385 1.0622 1.0623 1.0857 1.0975 1.0950 1.0940 1.1044 1.1021 1.1023
irintensity: 2.2105 1.1644 5.3878 1.1744 4.0132 1.0823 0.1734 1.2162 6.1337 2.0386 9.9814 5.7016 10.9577 18.6539 7.3044 7.7419 6.6727 6.8736 5.7143 15.9789 31.2237 2.0947 0.6361 21.5705 8.9037 53.8265 71.9627 9.0223 8.6557 5.4539 18.9039 16.3722 43.2119 306.0829 19.3601 51.2047 6.0139 5.4979 52.1462 28.3725 31.8318 5.2273 19.7069 10.0028 33.8160 25.8974 16.5962 98.6328 164.2392 0.7419 1.6672 1.3441 22.9378 5.6215 2.6427 10.5442 8.7811 9.3965 9.5440 7.9354
temp: 298.150 k
press: 1.00000 atm
elementType: 17 8 8 8 6 6 6 6 6 6 6 1 1 1 1 1 1 1 1 1 1 1
symmnumber: 1
zpe: 447731.8 jmol-1
zpe.correction: 0.170532 hartree
zpe.thermalcorrener: 0.184067 hartree
zpe.thermalcorrenthalpy: 0.185011 hartree
zpe.thermalcorrgfe: 0.127048 hartree
zpe.sumelectzpe: -958.207910 hartree
zpe.sumelectthermal: -958.194375 hartree
zpe.sumelectthermalent: -958.193431 hartree
zpe.sumelectthermalfe: -958.251395 hartree
dipole: 0.2470 0.9692 0.5029
dipole: 1.1195
quadrupole: -60.5486 -79.9619 -75.2272
quadrupole: -1.4019 9.4646 -0.0602
quadrupole: 11.3640 -8.0493 -3.3147 -1.4019 9.4646 -0.0602
hfenergy: -958.3784422 hartree
pointgroup: C01 [X(C7H11Cl1O3)]
dipole: 0.0491007 0.4315848 -0.0728456 debye
dipolederiv: -0.3551785 -0.078837 0.057906 -0.1102656 -0.3875902 0.1497217 0.0884073 0.21482 -0.3178643 -1.2286747 -0.2961413 0.2957118 -0.4262364 -0.4549749 0.1733668 0.4486046 0.1812407 -0.7410387 -0.5922102 -0.0069098 -0.1250276 -0.0686105 -0.8217267 0.0646326 -0.0952828 -0.0015629 -0.2791758 -0.5994508 -0.1371605 -0.1329791 -0.1225661 -0.3763529 -0.1211108 0.2107667 0.016211 -0.9473358 -0.2086278 -0.0499865 -0.0194598 -0.1006507 -0.1354119 0.1208561 -0.0204093 0.0744526 -0.0080061 0.1885554 0.3137306 -0.2436167 0.4503105 0.2571164 -0.1603161 -0.1919535 -0.1802084 0.4348666 0.7627546 0.1147799 -0.0906284 0.116427 0.3291027 -0.0703258 0.0597564 0.0406792 0.2290043 0.9752704 -0.092405 0.4089074 -0.0429122 0.9213199 -0.0835712 0.2962758 -0.021177 0.1245781 -0.5362012 -0.142002 -0.1178772 -0.0946461 -0.053073 -0.0150709 -0.0405272 -0.0014426 0.0100494 1.2414005 0.5133291 -0.1243818 0.6041069 0.4925815 -0.0044309 -0.6264563 -0.1485615 1.3883337 -0.2509806 -0.171455 -0.0649164 -0.2761731 -0.1408789 -0.0804874 -0.0880881 -0.0734485 -0.0486662 0.058165 0.0243737 0.0112002 0.0371986 0.0448464 -0.0734707 0.0091194 -0.083148 -0.0059517 0.0760609 -0.0492419 0.0430719 -0.0356589 0.0386249 0.0650101 -0.0190984 0.0472136 0.0209674 0.0640106 -0.0026754 0.0199463 -0.0389174 -0.0124346 -0.0274022 0.0128258 -0.0254679 -0.0544615 0.0306307 -0.0418124 0.0312609 -0.0162311 0.0355014 0.0637648 0.0076317 0.0932645 -0.0098005 -0.006765 -0.0004904 0.021944 -0.0103937 -0.0040577 -0.0465154 -0.0367169 -0.1398987 -0.0097501 0.09377 0.0450622 0.0309925 0.0217695 -0.0500033 -0.086524 -0.0178465 -0.0857521 0.0746489 0.1004064 -0.0086583 0.0369832 -0.022053 0.1216212 0.0065421 0.0647899 0.0079547 -0.0176526 0.0537695 0.0309825 -0.0594037 0.0542357 0.014883 0.0856702 -0.1030754 0.0543864 0.0454799 0.0792545 -0.0094433 -0.0433369 0.0416817 0.0956558 0.0861147 -0.0663957 0.0695994 -0.0194181 -0.0154717 -0.0224318 0.0644982 0.0054811 0.1286316 -0.0155361 0.1078118 -0.0138211 0.0047094 0.0695118 0.0673927 -0.0007947 0.0341039 -0.043381 -0.0309177 -0.0001391 -0.0253334 0.1264838 unknown
polarizability: 110.5881662|12.7386977|87.1298232|-0.4453963|-9.4008598|81.5744428 unknown
InChI: InChI=1S/C7H11ClO3/c1-5(9)7(8)3-4-11-6(2)10/h7H,3-4H2,1-2H3
charge 0 multiplicity 1
22 atoms
Cl 2.204433 1.590282 -1.07767
O  -2.150546 0.081469 -0.767094
O  2.432774 -1.811212 0.604264
O  -2.603975 -0.117138 1.513884
C  0.230021 -0.231491 -0.15216
C  1.532006 0.422273 0.297941
C  -0.882126 0.789598 -0.433984
C  2.663832 -0.575631 0.629125
C  4.023384 -0.008511 0.998395
C  -2.926158 -0.338698 0.324178
C  -4.150039 -1.08738 -0.151968
H  0.412654 -0.863779 -1.037735
H  -0.089285 -0.905353 0.665874
H  1.383223 1.114774 1.146624
H  -0.667185 1.39413 -1.327731
H  -1.056843 1.442146 0.441374
H  3.945154 0.982491 1.476374
H  4.625659 0.122507 0.079836
H  4.551121 -0.716595 1.65698
H  -4.526339 -0.666401 -1.097242
H  -4.929301 -1.055339 0.624015
H  -3.884266 -2.144742 -0.335382
