program: Gaussian 09
title: 000114545
version: EM64L-G09RevD.01
frameworkgroup: C1[X(C13H15Cl3O3)]
method: RPBEPBE
basis: SDD
operation: Freq
keyword: #p
keyword: freq=noraman
keyword: PBEPBE/SDD
title: #p freq=noraman PBEPBE/SDD
converged: YES YES NO NO
title: Mulliken charges:
elementType: Cl Cl Cl O O O C C C C C C C C C C C C C H H H H H H H H H H H H H H H
charge: -0.002367 -0.011849 -0.002996 -0.271411 -0.245228 -0.199789 -0.341924 -0.351059 -0.308737 -0.119131 0.242369 -0.684578 -0.714706 0.554226 -0.365230 -0.260421 -0.113447 -0.186316 -0.124413 0.229190 0.207273 0.193642 0.202473 0.226451 0.232777 0.251877 0.215026 0.217268 0.219019 0.245828 0.220398 0.257683 0.304332 0.283771
chargesum: 0.00000
title: Mulliken charges with hydrogens summed into heavy atoms:
elementType: Cl Cl Cl O O O C C C C C C C C C C C C C
charge: -0.002367 -0.011849 -0.002996 -0.271411 -0.245228 -0.199789 0.094538 0.045056 0.150491 0.132746 0.242369 -0.033265 0.009203 0.554226 -0.365230 0.043911 -0.113447 0.097455 -0.124413
polarizability: 1.91201851e+02 2.02692194e+00 2.28370993e+02 2.41629275e+01 1.04981961e+01 1.21821735e+02
1716.lowfreq: -5.4443 -4.5595 -0.0030 -0.0024 -0.0012 5.6293 12.9195 21.0525 35.4200
frequency: 12.6830 20.9539 35.3511 45.9074 55.5147 66.8770 76.5144 98.1614 108.5049 133.7094 165.6767 180.2563 187.0000 199.9944 221.3294 227.7721 229.3314 237.6665 253.5611 291.0380 304.7411 321.4244 344.7226 361.3982 413.8156 441.2835 448.5103 485.1028 523.0884 564.6791 606.0329 648.6343 655.4328 693.8450 709.3818 713.6773 744.8658 783.9190 818.0297 835.6438 850.4412 868.4583 893.2705 905.4488 931.9139 946.3558 1022.1723 1031.4745 1037.5614 1074.7855 1076.9269 1095.7559 1117.8837 1125.5805 1142.9160 1164.4939 1227.7377 1231.2781 1252.9571 1274.3862 1288.5729 1291.7652 1319.6303 1322.2898 1331.9562 1344.4389 1368.3097 1372.8160 1392.6854 1394.9135 1453.0032 1457.0109 1461.7097 1470.3154 1471.5921 1477.3177 1479.5685 1488.4612 1556.3304 1588.9390 1656.5027 2969.3550 2978.6635 2991.9608 3004.6263 3014.4028 3021.9701 3024.4952 3053.8049 3076.3561 3079.2379 3106.0663 3107.4591 3120.3350 3173.6322 3181.0609
redmass: 4.6370 5.3994 5.5808 4.2279 4.4087 2.4563 9.2709 5.1632 2.4241 9.0652 7.0611 17.9841 5.7902 2.4051 2.0877 2.2231 3.4195 1.3536 2.6870 6.0331 5.8379 11.9327 6.5964 8.3831 3.3210 8.0135 3.2033 6.7964 6.8347 5.0848 10.2869 3.8502 7.4019 3.5023 6.1656 7.3780 1.0749 1.7881 1.7741 5.6227 1.5105 1.3846 4.0494 2.1525 3.6881 1.2774 2.2992 3.5588 5.8372 2.0634 2.4044 3.0690 2.5742 1.9730 2.3684 1.7556 1.3089 4.6898 1.2622 1.2762 1.1532 1.0642 1.5691 1.5736 3.3479 1.4467 1.4004 8.2283 1.2149 1.2094 1.1087 2.5342 1.0820 1.0732 1.0547 1.0627 1.0438 1.0843 8.5476 8.3942 9.3027 1.0586 1.0363 1.0598 1.0353 1.1002 1.0849 1.0592 1.1030 1.1008 1.0998 1.0996 1.1082 1.1016 1.0922 1.0930
irintensity: 0.1563 0.1925 0.6697 0.6695 0.4183 0.0991 0.1007 0.6683 0.1459 0.2421 1.5094 0.2055 0.4121 0.6962 1.7888 0.4371 1.2998 0.6908 1.1641 4.4673 7.3298 4.5635 2.1975 2.4740 7.3815 2.4825 12.5036 3.7997 13.1896 0.5851 0.1838 12.5310 41.5677 0.5350 36.0027 6.5114 9.5759 1.6446 6.7381 11.8718 1.5249 54.5628 33.9256 2.5855 29.3266 2.1300 27.6575 15.4028 169.7747 161.2624 11.6941 151.6571 4.8848 54.4472 13.2592 9.9091 2.1431 115.4151 7.1090 4.2342 0.6466 1.6715 9.7951 47.1686 58.4785 3.6095 1.9186 5.6048 28.2392 14.2264 17.6159 213.2899 27.8106 2.7557 11.6556 6.6842 13.2233 24.1656 5.5846 26.5801 123.1911 32.8538 25.4905 23.3983 10.8302 9.4692 17.2879 42.8007 7.3130 56.0266 52.0452 15.9939 23.2366 10.7364 6.8186 0.4928
temp: 298.150 k
press: 1.00000 atm
elementType: 17 17 17 8 8 8 6 6 6 6 6 6 6 6 6 6 6 6 6 1 1 1 1 1 1 1 1 1 1 1 1 1 1 1
symmnumber: 1
zpe: 666495.7 jmol-1
zpe.correction: 0.253855 hartree
zpe.thermalcorrener: 0.274927 hartree
zpe.thermalcorrenthalpy: 0.275871 hartree
zpe.thermalcorrgfe: 0.200062 hartree
zpe.sumelectzpe: -2108.780891 hartree
zpe.sumelectthermal: -2108.759820 hartree
zpe.sumelectthermalent: -2108.758876 hartree
zpe.sumelectthermalfe: -2108.834684 hartree
dipole: -3.2407 0.5368 -1.9502
dipole: 3.8201
quadrupole: -122.4364 -135.9225 -135.3795
quadrupole: 1.5090 3.8399 -9.5311
quadrupole: 8.8098 -4.6764 -4.1334 1.5090 3.8399 -9.5311
hfenergy: -2109.0347463 hartree
pointgroup: C01 [X(C13H15Cl3O3)]
dipole: 1.2229891 0.5556841 0.674071 debye
polarizability: 192.9940771|-3.2020341|220.7827692|26.5095558|-24.9427211|127.6177324 unknown
InChI: InChI=1S/C13H15Cl3O3/c1-3-4-5-18-13(17)8(2)19-12-7-10(15)9(14)6-11(12)16/h6-8H,3-5H2,1-2H3
charge 0 multiplicity 1
34 atoms
Cl -3.3189 1.184634 -1.141642
Cl 0.493198 -2.804936 2.143142
Cl -2.344972 -3.888547 0.84712
O  2.631989 1.365366 0.934858
O  -0.735068 1.886906 0.118218
O  1.963164 1.926054 -1.237772
C  3.730639 -0.687479 0.025987
C  5.069575 -1.32853 -0.41298
C  3.916519 0.784473 0.414814
C  0.502994 2.450791 0.705087
C  1.749009 1.887796 -0.009961
C  4.902254 -2.813207 -0.802071
C  0.399049 3.96254 0.490582
C  -1.030165 0.54131 0.333147
C  -2.248336 0.058952 -0.217237
C  -0.212852 -0.358104 1.060602
C  -0.606717 -1.702029 1.216854
C  -2.639133 -1.279107 -0.056357
C  -1.81401 -2.169724 0.664824
H  2.998126 -0.758506 -0.800135
H  3.316056 -1.248575 0.88606
H  5.809133 -1.242523 0.409119
H  5.485285 -0.765338 -1.27276
H  4.614169 0.904847 1.259628
H  4.247718 1.390009 -0.448186
H  0.555165 2.194191 1.779791
H  4.508046 -3.403749 0.04579
H  4.196155 -2.924634 -1.645604
H  5.86669 -3.258385 -1.106613
H  -0.510544 4.346398 0.980867
H  1.278366 4.472522 0.92172
H  0.348325 4.185148 -0.587761
H  0.734381 -0.034337 1.498205
H  -3.579109 -1.632125 -0.487936
