program: Gaussian 09
title: 000114269
version: EM64L-G09RevD.01
frameworkgroup: C1[X(C10H9F3N2)]
method: RPBEPBE
basis: SDD
operation: Freq
keyword: #p
keyword: freq=noraman
keyword: PBEPBE/SDD
title: #p freq=noraman PBEPBE/SDD
converged: YES YES NO NO
title: Mulliken charges:
elementType: F F F N N C C C C C C C C C C H H H H H H H H H
charge: -0.172164 -0.166443 -0.170758 -0.208663 -0.078024 0.312116 0.028030 0.205573 -0.342754 -0.463638 0.307340 -0.330733 -0.651175 -0.790695 0.238378 0.242196 0.282927 0.257421 0.254079 0.246505 0.246852 0.279869 0.236945 0.236815
chargesum: 0.00000
title: Mulliken charges with hydrogens summed into heavy atoms:
elementType: F F F N N C C C C C C C C C C
charge: -0.172164 -0.166443 -0.170758 -0.208663 -0.078024 0.312116 0.028030 0.205573 -0.100558 -0.180710 0.307340 -0.073312 0.096261 -0.037066 0.238378
polarizability: 1.84243800e+02 -6.32819546e+00 1.22584514e+02 1.60806962e-01 4.03623846e-02 6.46825068e+01
1716.lowfreq: -9.8931 -8.2781 -0.0008 0.0006 0.0007 2.3568 16.6755 59.4439 66.6183
frequency: 16.4467 59.3607 66.6126 129.8288 136.7594 152.7511 168.2973 229.7869 263.9298 267.6254 292.0812 306.2030 364.8247 386.2974 436.0485 491.9550 495.9337 523.1421 552.0572 588.4673 631.7019 647.5888 665.4712 683.0615 736.4666 774.3121 813.4102 861.3453 892.4495 914.7659 946.0163 975.8569 993.3127 1013.6133 1033.3884 1046.3686 1087.5837 1121.4559 1151.7731 1176.2331 1191.2051 1257.0305 1297.7592 1310.8699 1369.7895 1396.1032 1402.7385 1441.4280 1445.2140 1464.9400 1468.7854 1480.9125 1487.7137 1488.7934 1518.7672 1595.5757 1634.6268 2983.7848 2987.6483 3058.7560 3067.6949 3120.2696 3125.6568 3147.7342 3171.0620 3180.8030
redmass: 9.0962 1.0843 4.4263 3.1453 6.2925 1.2573 2.8262 4.6207 5.2181 5.0735 3.9056 4.7642 7.8345 8.5191 3.1467 8.1907 7.9826 6.6186 4.4290 5.9697 3.9703 7.6207 5.6370 5.6500 7.3131 4.0921 1.5349 3.4425 6.2037 1.5190 1.3442 8.8747 1.7961 3.7459 4.7178 1.5049 3.1939 1.3151 1.4836 1.9145 3.7940 1.8390 4.3454 2.7188 3.8407 1.2769 4.0524 1.4325 2.2271 1.0430 1.5429 1.0422 1.1312 3.7645 4.3195 7.4080 7.6987 1.0395 1.0360 1.0979 1.1023 1.0979 1.0963 1.0889 1.0965 1.0934
irintensity: 0.7601 0.0624 1.1039 0.3690 0.3557 1.1086 3.4152 2.7074 3.2533 0.9472 0.5587 2.4930 3.5152 0.9469 4.1151 3.1740 0.3617 5.9364 4.3630 10.6091 4.0852 9.0690 4.9487 0.8296 13.4297 0.5719 62.6373 57.9259 42.2103 62.2005 0.6282 208.4045 12.1053 108.9301 114.1902 3.1094 40.6507 0.3988 9.5326 2.7676 70.2135 44.0212 326.0614 54.7416 69.9673 15.7157 7.7381 9.9687 72.5070 34.5527 13.1689 0.0031 3.8898 3.2730 51.3563 0.8441 38.3043 21.7790 51.7304 15.3122 20.8026 8.4265 3.6334 4.7021 4.9871 0.3240
temp: 298.150 k
press: 1.00000 atm
elementType: 9 9 9 7 7 6 6 6 6 6 6 6 6 6 6 1 1 1 1 1 1 1 1 1
symmnumber: 1
zpe: 455718.9 jmol-1
zpe.correction: 0.173574 hartree
zpe.thermalcorrener: 0.187168 hartree
zpe.thermalcorrenthalpy: 0.188112 hartree
zpe.thermalcorrgfe: 0.131844 hartree
zpe.sumelectzpe: -794.433970 hartree
zpe.sumelectthermal: -794.420376 hartree
zpe.sumelectthermalent: -794.419432 hartree
zpe.sumelectthermalfe: -794.475699 hartree
dipole: 7.3132 3.7668 -0.0833
dipole: 8.2267
quadrupole: -78.3423 -82.4064 -89.4105
quadrupole: 5.6691 0.5382 0.0113
quadrupole: 5.0441 0.9800 -6.0241 5.6691 0.5382 0.0113
hfenergy: -794.6075437 hartree
pointgroup: C01 [X(C10H9F3N2)]
dipole: 2.8600489 1.5148601 0.03272 debye
dipolederiv: -0.7670002 0.177707 -0.1770097 0.2240686 -0.485284 0.2007529 -0.1384567 0.1766439 -0.4497214 -0.5669377 -0.1888506 -0.0669677 -0.2433225 -0.6751985 -0.1901577 -0.0300984 -0.1596516 -0.364541 -0.8036949 -0.037124 0.231991 -0.0404858 -0.2783904 -0.0080683 0.3822858 0.0110008 -0.7550206 -0.826419 0.0164789 -0.0066328 -0.088694 -0.6525454 -0.0221375 -0.0121873 -0.0202606 -0.128914 -0.7577819 -0.1222952 -0.0106066 -0.0508208 -0.4344127 -0.0076774 -0.0104182 -0.0099922 -0.2618443 0.6415519 -0.0211678 0.0062035 0.2752221 -0.2271648 -0.0094735 0.0195699 -0.013869 0.06885 0.1445524 -0.1201156 -0.0042776 -0.5238894 0.0310208 -0.002604 -0.012814 0.0012664 0.0147453 0.5920506 -0.0847527 0.0040811 0.0737945 0.8450012 0.0337415 0.0091501 0.0323914 0.0239529 -0.0927107 -0.0266079 0.0003783 0.0083629 0.0986097 0.0076511 0.0048766 0.0087473 -0.1779377 0.2270879 0.047685 0.0066549 -0.1053762 0.0561283 0.0058573 0.0184749 0.0152423 -0.0978743 -0.6504963 -0.0405786 -0.0095711 0.0183409 -0.1352705 0.001802 -0.1108684 -0.0057046 -0.1886214 -0.0267382 0.019651 0.0044556 0.1164425 0.0674147 0.0088875 0.0325869 0.0021703 -0.134807 0.2881669 0.1960891 0.0081002 0.2785648 0.3555581 0.0075384 0.0119733 0.0072361 0.2353925 -0.1838317 0.0946064 0.0003875 0.0055064 -0.0203946 -0.0035717 -0.0017348 -0.0026944 0.0814685 2.4618092 0.0958482 0.0158049 0.1682769 1.3450222 -0.0048382 -0.144254 -0.0268008 1.5526389 0.0570731 -0.0736159 -0.0045751 -0.044292 -0.0647442 -0.008446 -0.0054596 -0.0079752 0.1722242 0.1072727 -0.0222727 -0.0012545 -0.0390244 0.0254304 -0.0049955 -0.003833 -0.0079521 0.1638267 0.0377406 0.0777309 0.0016129 0.0677101 0.0313594 -0.0043256 -0.0044783 -0.0010145 0.1622299 -0.0889873 0.0107223 -0.0018042 0.0905686 0.0865071 -0.0002736 0.0010727 -0.0012052 0.1157834 0.0794843 0.0187362 -0.0583382 -0.0896327 -0.0440771 0.0726009 0.0058245 0.1146774 -0.0400329 0.0782401 0.0161877 0.0623095 -0.0874469 -0.0289941 -0.0734382 -0.0101216 -0.1133436 -0.0535989 0.1189286 -0.04735 -0.001905 0.0427585 -0.0540761 -0.0063352 0.0012959 -0.0074306 0.1319845 -0.0370434 0.003876 0.0589475 -0.0333975 0.0739834 0.0919333 0.1102456 0.0609951 -0.0277845 -0.0323168 0.0094126 -0.0579843 -0.0232344 0.0845171 -0.0844225 -0.1126319 -0.0524765 -0.0423986 unknown
polarizability: 184.3779271|-5.6356847|122.3749025|0.4873588|2.0351324|64.7579908 unknown
InChI: InChI=1S/C10H9F3N2/c1-6-14-8-5-7(10(11,12)13)3-4-9(8)15(6)2/h3-5H,1-2H3
charge 0 multiplicity 1
24 atoms
F  -3.791286 0.773951 -0.772465
F  -3.398094 -1.45411 -0.552287
F  -3.609103 -0.14683 1.284808
N  2.541851 0.601817 0.02722
N  1.818702 -1.573002 -0.068644
C  1.14351 0.662846 0.012083
C  0.705134 -0.704897 -0.047823
C  2.895568 -0.767649 -0.022605
C  0.240121 1.745727 0.038241
C  -0.670402 -1.004808 -0.076971
C  -1.575784 0.078017 -0.0506
C  -1.131324 1.433503 0.008052
C  3.438644 1.758986 0.084035
C  4.315147 -1.244177 -0.023021
C  -3.049971 -0.186196 -0.031119
H  0.572925 2.787526 0.078448
H  -1.015816 -2.040624 -0.126747
H  -1.872603 2.238192 0.01684
H  4.484331 1.416863 0.082448
H  3.285324 2.416777 -0.790506
H  3.264367 2.344953 1.004486
H  4.305977 -2.343373 -0.063265
H  4.879765 -0.869144 -0.897134
H  4.858718 -0.934349 0.889124
