program: Gaussian 09
title: 000114713
version: EM64L-G09RevD.01
frameworkgroup: C1[X(C20H18ClNO7)]
method: RPBEPBE
basis: SDD
operation: Freq
keyword: #p
keyword: freq=noraman
keyword: PBEPBE/SDD
title: #p freq=noraman PBEPBE/SDD
converged: YES YES NO NO
title: Mulliken charges:
elementType: Cl O O O O O O O N C C C C C C C C C C C C C C C C C C C C H H H H H H H H H H H H H H H H H H
charge: -0.053236 -0.229240 -0.423250 -0.340906 -0.186113 -0.368409 -0.440054 -0.204467 -0.415021 -0.282950 -0.037679 0.658699 -0.062665 -0.027647 -0.476846 0.205919 -0.710881 0.160160 -0.335125 -0.156897 -0.603664 0.272817 0.533415 0.167197 -0.363226 -0.425121 -0.227871 -0.228021 -0.233287 0.240018 0.233350 0.240789 0.199727 0.267862 0.225644 0.317954 0.219374 0.251894 0.342356 0.354443 0.397341 0.228788 0.226896 0.230813 0.227872 0.233389 0.395856
chargesum: 0.00000
title: Mulliken charges with hydrogens summed into heavy atoms:
elementType: Cl O O O O O O O N C C C C C C C C C C C C C C C C C C C C
charge: -0.053236 -0.229240 -0.068807 0.056435 -0.186113 -0.368409 -0.044198 -0.204467 -0.072665 -0.042932 0.195671 0.658699 -0.062665 -0.027647 -0.476846 0.205919 -0.002503 0.160160 -0.109481 0.161057 -0.132395 0.272817 0.533415 0.167197 -0.134437 -0.198224 0.002943 -0.000149 0.000103
polarizability: 3.17350780e+02 -1.42902318e+01 2.63608865e+02 -3.34948399e+01 -3.01141855e+01 2.03040125e+02
1716.lowfreq: -10.5253 -1.7140 -0.0015 -0.0015 0.0011 4.4422 7.7891 13.9981 16.6083
frequency: -7.4759 13.8321 16.2566 32.6610 36.4271 49.8337 52.9979 60.4690 72.0332 81.7332 105.7384 122.5985 125.1398 142.0816 161.4543 183.9235 194.0195 216.3462 224.7468 240.1775 249.6753 276.1502 290.6521 292.5805 307.3804 336.3500 344.1584 356.0108 372.6587 389.6113 403.3181 406.9094 426.8131 459.9297 480.9431 487.1324 492.1113 530.1294 547.9283 557.6388 562.9461 591.8942 607.3239 612.3467 617.5734 632.5281 656.6839 683.5930 690.7772 697.2694 702.8390 718.7730 734.2305 757.9898 789.9560 799.9832 803.3306 847.6881 849.2796 862.4450 871.5436 876.0609 894.3738 921.6125 926.2513 944.3862 974.3115 975.8758 990.7826 992.9504 996.9422 1025.6750 1027.6649 1034.3180 1042.7772 1075.1213 1086.4155 1101.1773 1120.4615 1144.2903 1169.0465 1174.9936 1189.7543 1199.7182 1201.6779 1206.2354 1217.0942 1259.7765 1264.2167 1279.5885 1297.3769 1302.5792 1310.6870 1316.8398 1323.5442 1336.1600 1337.2455 1347.5456 1370.1394 1384.9492 1390.0706 1396.1188 1401.2442 1439.1630 1441.9887 1461.1048 1469.8190 1475.2445 1485.3827 1516.6989 1562.1132 1568.3214 1595.2507 1614.9494 1623.1755 1655.3356 1676.1451 2640.6158 2976.8204 2990.9649 2996.1515 3003.4038 3052.1235 3068.1577 3097.1611 3114.9009 3120.3413 3128.7695 3136.5122 3149.0530 3152.1563 3167.1662 3526.3179 3555.5231 3576.3797
redmass: 5.0866 6.3656 5.8900 5.8657 8.8929 5.8125 7.6273 7.2441 4.8118 5.4759 9.5861 7.3317 6.8009 5.2495 7.6614 4.8087 4.5858 2.3679 1.9127 4.2712 3.8037 5.8980 2.0874 3.6103 2.3108 8.0624 2.5876 7.2777 4.0705 7.7204 2.8117 5.3480 7.2555 5.1210 3.8209 6.0514 4.6584 5.2010 3.1454 4.4873 1.9556 1.7201 4.6991 2.4003 5.3901 9.9302 3.8182 6.6822 4.0668 8.1040 1.8188 6.4610 7.7824 1.8973 7.3897 6.2867 5.3081 4.4034 1.3475 1.5960 3.0682 2.2230 3.9603 3.3897 1.6280 2.3265 1.3854 1.0728 5.7163 3.1854 1.3423 3.9526 2.1948 2.3719 6.2381 2.3325 1.8766 2.5212 2.2616 1.9339 2.1331 1.0736 1.1371 1.2557 1.6530 1.8872 2.4398 1.3114 2.4011 1.8031 2.0305 2.0439 1.3528 1.3884 1.7233 1.2574 1.3517 2.3625 2.1043 7.4175 2.5671 1.4544 4.2294 3.4078 2.1575 1.0466 1.1332 1.0551 2.2992 2.0919 9.5011 3.8585 6.0363 6.1307 3.5997 9.5426 9.3143 1.0732 1.0834 1.0813 1.0592 1.0406 1.0960 1.0915 1.0978 1.0882 1.0878 1.1008 1.0901 1.0956 1.0915 1.1014 1.0644 1.0665 1.0770
irintensity: 0.9251 0.1940 0.1376 1.0475 3.1685 2.5476 0.1726 0.6693 0.3132 0.9836 3.1478 0.1315 0.0116 3.7044 0.6502 3.0104 0.5562 3.6978 0.3026 17.7027 0.8095 6.6531 46.4202 40.8515 57.1425 4.8599 1.3745 1.4402 14.1453 12.9630 0.4194 15.0042 12.0103 2.6478 13.1424 3.0403 2.0112 48.9450 15.5388 5.0985 18.2421 217.4365 24.0570 54.4972 6.3444 16.5434 19.3540 6.9540 25.2894 53.5808 47.5450 2.5373 7.7789 52.1918 24.9222 27.7051 12.0791 9.0518 0.9013 13.3516 21.1242 17.0388 7.5153 18.8779 12.5827 61.9267 4.6518 120.1594 0.2269 1.4357 0.1623 23.7688 5.8120 74.7056 287.1996 188.8916 66.5523 22.1826 24.8716 47.8380 120.5088 4.8384 8.8408 28.7388 12.4659 113.3925 5.9229 11.0423 31.7029 22.0723 17.8189 69.8548 5.0629 46.4515 50.8840 4.5990 12.0503 56.5465 71.9689 0.2878 137.6301 7.7175 41.7509 111.3249 5.1675 10.8636 41.3338 11.5814 10.7027 441.4067 130.4841 46.7126 1.2972 4.0744 90.9218 236.0027 277.4580 722.0088 9.1264 31.3843 23.0254 35.3899 7.5082 10.2676 18.4413 8.5463 7.3529 10.2177 6.0408 31.1937 4.6650 17.5740 42.6734 13.4892 38.0829
temp: 298.150 k
press: 1.00000 atm
elementType: 17 8 8 8 8 8 8 8 7 6 6 6 6 6 6 6 6 6 6 6 6 6 6 6 6 6 6 6 6 1 1 1 1 1 1 1 1 1 1 1 1 1 1 1 1 1 1
symmnumber: 1
zpe: 909740.9 jmol-1
zpe.correction: 0.346502 hartree
zpe.thermalcorrener: 0.372797 hartree
zpe.thermalcorrenthalpy: 0.373741 hartree
zpe.thermalcorrgfe: 0.287043 hartree
zpe.sumelectzpe: -1812.244356 hartree
zpe.sumelectthermal: -1812.218061 hartree
zpe.sumelectthermalent: -1812.217117 hartree
zpe.sumelectthermalfe: -1812.303815 hartree
dipole: 3.0823 -7.5398 4.0192
dipole: 9.0832
quadrupole: -179.7302 -172.5140 -177.3834
quadrupole: 17.7836 2.0992 6.5316
quadrupole: -3.1876 4.0285 -0.8409 17.7836 2.0992 6.5316
hfenergy: -1812.590858 hartree
pointgroup: C01 [X(C20H18Cl1N1O7)]
dipole: 1.1283483 -0.0135152 3.3907513 debye
polarizability: 300.7190718|-56.1048301|207.4343128|-0.7348096|-4.670954|275.8463856 unknown
InChI: InChI=1S/C20H18ClNO7/c1-9-16(23)14-12(21)8-11(17(24)15(14)20(28)29-9)18(25)22-13(19(26)27)7-10-5-3-2-4-6-10/h2-6,8-9,13,16,22-24,26H,7H2,1H3
charge 0 multiplicity 1
47 atoms
Cl -2.50596 1.199081 3.413939
O  -4.781205 0.580955 -1.514887
O  -4.43084 2.586343 0.672613
O  -0.840248 -0.879621 -1.979506
O  -3.028164 0.495573 -2.963819
O  1.388409 -1.471885 -1.032393
O  2.913908 -2.383558 3.234245
O  4.568514 -3.450675 1.991249
N  1.971787 -1.031948 1.160246
C  -4.353617 1.130774 0.878464
C  -5.29549 0.44576 -0.121133
C  -2.934736 0.611599 0.690668
C  -2.512682 0.181776 -0.595994
C  -1.201492 -0.38068 -0.769085
C  -2.013812 0.5645 1.761641
C  -0.292274 -0.42858 0.35502
C  -6.709387 1.020695 -0.140112
C  -3.410615 0.403648 -1.783089
C  -0.717256 0.06638 1.610915
C  3.32211 -1.575102 0.982848
C  4.432903 -0.459259 0.979081
C  1.064808 -1.000361 0.131572
C  4.216698 0.571771 -0.116709
C  3.672759 -2.588872 2.068686
C  4.458443 0.242201 -1.47504
C  3.760546 1.876089 0.19772
C  4.247342 1.193925 -2.495212
C  3.547895 2.832896 -0.82145
C  3.789602 2.493084 -2.171622
H  -4.697609 0.875295 1.901532
H  -5.311476 -0.637181 0.122251
H  -7.30688 0.515021 -0.916515
H  -7.200942 0.868863 0.83825
H  -6.673651 2.099413 -0.355707
H  -0.056967 0.066526 2.483303
H  3.33945 -2.091392 0.007849
H  4.445496 0.028804 1.972082
H  5.401935 -0.977506 0.851071
H  1.709908 -0.742717 2.102627
H  -3.892999 3.033119 1.375666
H  0.141052 -1.230653 -1.890291
H  4.809583 -0.763606 -1.737335
H  3.578583 2.148141 1.245192
H  4.434516 0.923887 -3.54021
H  3.195509 3.837734 -0.563302
H  3.621343 3.230599 -2.963948
H  3.192608 -3.029458 3.937728
