program: Gaussian 09
title: 000114406
version: EM64L-G09RevD.01
frameworkgroup: C1[X(C22H29N)]
method: RPBEPBE
basis: SDD
operation: Freq
keyword: #pfreq=noraman
keyword: PBEPBE/SDD
title: #p freq=noraman PBEPBE/SDD
converged: YES YES NO NO
title: Mulliken charges:
elementType: N C C C C C C C C C C C C C C C C C C C C C C H H H H H H H H H H H H H H H H H H H H H H H H H H H H H
charge: -0.088102 0.150424 0.164944 -0.645115 0.238528 0.312466 -0.454447 0.396403 -0.731317 -0.757432 -0.450473 -0.427092 -0.443626 -0.399034 -0.387686 -0.372513 -0.263369 -0.246403 -0.244251 -0.269517 -0.246742 -0.607040 -0.625098 0.212983 0.216646 0.192887 0.246403 0.210220 0.252518 0.207425 0.221287 0.208485 0.214658 0.216300 0.237412 0.251402 0.237964 0.261898 0.230899 0.187806 0.204870 0.223354 0.222059 0.222396 0.222735 0.226051 0.219914 0.224805 0.185213 0.187278 0.229994 0.220630
chargesum: 0.00000
title: Mulliken charges with hydrogens summed into heavy atoms:
elementType: N C C C C C C C C C C C C C C C C C C C C C C
charge: -0.088102 0.150424 0.164944 -0.215486 0.238528 0.312466 -0.015157 0.396403 -0.061154 -0.113002 0.003239 -0.175690 -0.205662 -0.137136 -0.156787 0.020163 -0.040014 -0.024344 -0.021855 -0.046783 -0.020691 0.022892 0.012805
polarizability: 2.24532067e+02 -7.41991759e+00 2.54736644e+02 -1.24743809e+01 8.66115218e+00 2.27076939e+02
1716.lowfreq: -11.6417 -8.7447 -5.3943 -0.0004 -0.0004 -0.0003 25.5015 30.8235 41.0606
frequency: 24.6265 30.5460 40.8932 47.9062 62.8705 64.1236 91.7462 107.7825 119.9507 154.7359 185.9463 196.2842 215.1316 223.2208 232.7154 249.3920 256.5506 267.9433 271.7324 273.8731 291.1788 308.3634 335.1519 342.6577 354.7225 389.2526 408.2668 420.6696 447.8112 483.2265 518.8964 524.9315 531.9562 546.9747 586.0159 595.6362 617.9154 642.4201 703.5997 709.6471 718.2276 741.3616 764.0142 769.3077 775.5280 798.5218 831.3008 856.5196 859.4819 875.1380 886.4391 925.2654 928.6007 938.6545 946.5314 952.4660 974.9762 977.4415 981.8157 985.7497 990.3045 995.0404 1006.3312 1027.1329 1027.8046 1032.3259 1042.6875 1060.8297 1076.0745 1083.4564 1088.1066 1093.1765 1102.7762 1121.8204 1128.6522 1135.1048 1142.2764 1165.7279 1171.7134 1173.6728 1197.2302 1198.4607 1208.0078 1220.4579 1252.2411 1257.8719 1270.5674 1276.4130 1283.4498 1302.5265 1307.5559 1311.4071 1321.5718 1353.9200 1366.6210 1371.6451 1376.5856 1384.0038 1395.0317 1416.1416 1430.3159 1440.6267 1441.3671 1454.0804 1457.7865 1461.0565 1463.0161 1464.9870 1466.0743 1472.8670 1473.6361 1474.7371 1480.2596 1481.5565 1483.6594 1486.6552 1486.8803 1584.6827 1592.2997 1607.2813 1612.1223 2821.8000 2837.8843 2855.2517 2966.8781 2968.6771 2972.5090 2980.6030 2986.9734 3004.3714 3017.5325 3026.2255 3026.9966 3050.0082 3058.8833 3063.8061 3067.2133 3073.1962 3076.9230 3082.6516 3087.1070 3114.4118 3117.3541 3120.6992 3126.0310 3135.2810 3139.9184 3152.0219 3155.7532 3163.4826
redmass: 3.7260 3.1835 3.0736 3.9412 3.6241 3.6094 3.5409 3.1823 3.4685 2.8775 2.5485 1.5219 1.6397 1.1765 1.3803 1.1861 2.1018 2.7077 2.9756 2.9699 2.4491 2.8230 2.8037 2.8943 1.9663 2.1767 2.8078 2.1940 3.2906 3.5406 3.1682 3.4327 3.5621 3.0949 3.8713 3.5609 6.3234 4.2121 4.6840 1.7355 4.0920 1.9217 1.6068 1.7195 3.0252 2.0675 2.3326 1.3188 2.3613 1.7071 1.6444 1.4617 1.7740 1.6166 1.7133 1.5941 1.7813 2.4741 1.4973 1.4044 4.7165 1.3405 1.4359 2.2943 2.4919 1.5273 2.3487 2.4310 1.9589 2.0946 1.4737 1.7767 2.2503 1.9031 1.8458 1.4924 1.8486 1.8255 1.0548 1.1462 1.1580 2.4737 2.5262 1.6899 2.2175 1.9464 1.9529 1.7645 1.6535 1.4169 1.3062 1.4441 1.4131 1.5135 1.3635 6.0140 1.1966 7.5140 1.2032 1.1415 2.2304 1.1887 2.1894 1.0919 1.0626 1.0594 1.0731 1.1103 1.5426 1.1804 1.2174 1.0564 1.0751 1.9733 1.0870 1.1139 1.0674 5.9224 7.1249 6.1168 6.5717 1.0702 1.0579 1.0583 1.0619 1.0353 1.0363 1.0632 1.0646 1.0851 1.0711 1.0812 1.0855 1.1014 1.0993 1.0989 1.0979 1.0995 1.1010 1.1002 1.0993 1.0851 1.0843 1.0890 1.0876 1.0938 1.0931 1.0946 1.1001 1.0997
irintensity: 0.0838 0.2004 0.1797 0.4330 0.1391 0.0202 0.1829 0.4619 0.3727 0.3641 0.6083 0.1109 0.3142 0.1783 0.0469 0.2609 0.6534 0.4381 0.4136 0.2888 2.9429 4.4177 0.4248 2.1298 4.1520 0.3407 0.0677 0.5797 0.1512 7.0891 11.0801 5.5931 0.9444 4.7599 4.2393 2.4510 0.0892 8.7718 1.1050 52.0440 1.5386 12.2074 32.8303 65.7092 7.2904 11.2984 0.6037 1.0739 3.0857 1.4228 1.7904 1.8050 0.1220 2.0387 2.7110 4.1279 9.9741 12.2897 4.9417 1.3910 0.6835 0.2609 3.8565 12.0651 5.4317 18.3454 3.1977 6.8382 8.2514 8.2187 7.3370 13.0226 6.6492 2.8100 1.9179 5.2667 1.6917 2.4531 0.0693 1.7544 0.9384 14.5021 4.6115 12.8342 4.0824 9.0916 11.4495 7.2618 1.0719 2.9022 6.1283 7.4701 3.1523 4.0720 6.8325 1.6299 14.1876 5.2868 10.4705 3.3510 7.5534 3.5309 8.3261 3.3839 4.7483 8.5054 4.0565 1.0205 15.8963 16.6674 6.5446 14.7587 10.0666 27.1534 17.7033 16.4400 9.6843 1.2077 0.3211 13.2878 2.2395 65.2088 71.4552 297.9807 9.1250 25.1625 47.2864 20.4766 41.8487 31.8337 41.6402 19.2426 17.6509 59.7456 3.3704 21.2360 55.3576 50.1368 29.5950 52.8086 27.8965 6.9304 3.2072 4.9886 4.6880 35.1980 34.7686 20.7041 42.3689 21.5906
temp: 298.150 k
press: 1.00000 atm
elementType: 7 6 6 6 6 6 6 6 6 6 6 6 6 6 6 6 6 6 6 6 6 6 6 1 1 1 1 1 1 1 1 1 1 1 1 1 1 1 1 1 1 1 1 1 1 1 1 1 1 1 1 1
symmnumber: 1
zpe: 1182315.5 jmol-1
zpe.correction: 0.450320 hartree
zpe.thermalcorrener: 0.473229 hartree
zpe.thermalcorrenthalpy: 0.474173 hartree
zpe.thermalcorrgfe: 0.397811 hartree
zpe.sumelectzpe: -908.761618 hartree
zpe.sumelectthermal: -908.738709 hartree
zpe.sumelectthermalent: -908.737765 hartree
zpe.sumelectthermalfe: -908.814127 hartree
dipole: -1.1929 0.2543 0.6390
dipole: 1.3770
quadrupole: -134.3332 -136.6274 -132.7366
quadrupole: -2.1461 -2.4269 -0.0324
quadrupole: 0.2325 -2.0617 1.8291 -2.1461 -2.4269 -0.0324
hfenergy: -909.2119385 hartree
pointgroup: C01 [X(C22H29N1)]
dipole: -0.4817464 0.0364378 0.2451098 debye
polarizability: 227.6366736|-11.8864489|252.2563996|-13.3083026|5.974611|226.4525776 unknown
InChI: InChI=1S/C22H29N/c1-21(2)17-22(15-10-16-23(3)4,18-11-6-5-7-12-18)20-14-9-8-13-19(20)21/h5-9,11-14H,10,15-17H2,1-4H3
charge 0 multiplicity 1
52 atoms
N  -4.245408 -1.292311 -0.170222
C  0.011866 0.116023 0.08908
C  1.600396 -0.984375 1.730587
C  0.153406 -0.401787 1.568874
C  1.01231 -0.812469 -0.627122
C  1.901998 -1.422197 0.29292
C  -1.433318 -0.119803 -0.473833
C  0.392605 1.616033 -0.056043
C  2.614644 0.106009 2.185618
C  1.623324 -2.160136 2.736905
C  -2.586732 0.579764 0.274991
C  1.104345 -1.110218 -2.003506
C  2.903106 -2.306658 -0.157117
C  1.179684 2.085866 -1.140369
C  -0.085868 2.58231 0.872065
C  -3.97217 0.163147 -0.268158
C  2.1025 -2.005934 -2.457774
C  3.003405 -2.596645 -1.539638
C  1.478668 3.459091 -1.292542
C  0.210825 3.954944 0.726015
C  0.995821 4.404064 -0.360338
C  -5.412031 -1.689311 -0.984061
C  -4.364979 -1.76952 1.221329
H  -0.058168 0.367579 2.330246
H  -0.571961 -1.227385 1.713978
H  -1.458827 0.204948 -1.534657
H  -1.632356 -1.208695 -0.474043
H  3.641873 -0.303651 2.204046
H  2.605157 0.975753 1.506637
H  2.369052 0.460697 3.204848
H  0.95795 -2.979608 2.40877
H  2.643245 -2.573001 2.852165
H  1.287793 -1.820951 3.735267
H  -2.527059 0.364238 1.360083
H  -2.504452 1.678256 0.170775
H  0.400765 -0.670324 -2.720143
H  3.590904 -2.781185 0.553241
H  1.582603 1.370927 -1.863902
H  -0.691744 2.264732 1.72753
H  -4.763684 0.75991 0.259725
H  -4.028013 0.435948 -1.340712
H  2.17482 -2.247265 -3.524461
H  3.772814 -3.289247 -1.900033
H  2.095795 3.787507 -2.137073
H  -0.170508 4.672769 1.461687
H  1.230711 5.468316 -0.474272
H  -5.53428 -2.787025 -0.950008
H  -5.249384 -1.395651 -2.036493
H  -6.373557 -1.225939 -0.641291
H  -5.199568 -1.276378 1.784789
H  -3.427498 -1.587875 1.774779
H  -4.548323 -2.858886 1.222263
