program: Gaussian 09
title: 000114131
version: EM64L-G09RevD.01
frameworkgroup: C1[X(C19H18N)]
method: RPBEPBE
basis: SDD
operation: Freq
keyword: #p
keyword: freq=noraman
keyword: PBEPBE/SDD
title: #p freq=noraman PBEPBE/SDD
converged: YES YES NO NO
title: Mulliken charges:
elementType: N C C C C C C C C C C C C C C C C C C C H H H H H H H H H H H H H H H H H H
charge: -0.035210 0.543627 0.500010 -0.643142 -0.736545 -0.382011 -0.382039 -0.375988 -0.375933 0.485254 -0.094902 -0.094901 -0.379042 -0.379022 -0.177913 -0.177908 -0.227398 -0.227396 -0.131849 -0.235911 0.267223 0.267217 0.233879 0.233885 0.223938 0.223947 0.246183 0.246181 0.288436 0.288436 0.222622 0.222616 0.281692 0.281692 0.234621 0.234618 0.291067 0.239963
chargesum: 1.00000
title: Mulliken charges with hydrogens summed into heavy atoms:
elementType: N C C C C C C C C C C C C C C C C C C C
charge: -0.035210 0.543627 0.500010 -0.108702 -0.268781 -0.158073 -0.158091 -0.129806 -0.129751 0.485254 0.193534 0.193536 -0.156420 -0.156406 0.103780 0.103784 0.007223 0.007221 0.159218 0.004051
polarizability: 2.18923275e+02 2.45458180e-01 1.87348680e+02 1.88290440e-02 -2.87096870e-04 1.96189192e+02
1716.lowfreq: -28.5351 -15.0235 -8.5318 0.0003 0.0004 0.0008 4.2150 5.2912 21.8720
frequency: -28.5228 -13.9088 21.8162 40.8509 59.0291 59.0797 123.9549 203.7959 206.9029 207.9364 287.9917 338.5296 368.1771 389.2387 399.0079 403.4893 407.8559 423.4960 466.1801 479.6860 526.1586 575.3131 616.7120 621.3877 634.5259 644.3166 688.6823 703.1782 706.7924 742.4679 756.4150 774.3922 791.5776 817.5992 828.6798 839.8496 852.6364 860.7969 871.2542 917.1396 924.9771 948.6458 950.8320 965.3277 974.2250 979.5750 984.4784 989.7168 1001.3453 1009.4251 1014.5594 1023.7142 1025.8156 1050.8797 1076.7016 1086.0479 1103.7839 1122.7491 1156.9097 1176.1492 1181.2432 1188.0540 1194.0450 1195.1559 1200.8654 1211.9094 1213.8384 1219.8828 1291.6002 1319.6992 1326.5777 1336.5051 1355.0177 1372.0415 1381.6509 1390.1919 1414.1737 1441.2604 1457.9763 1472.2389 1475.3484 1482.5002 1488.8641 1503.1846 1574.6630 1582.5856 1594.5164 1608.2939 1615.1688 1624.0269 3006.1539 3041.1989 3064.9922 3106.6135 3111.2767 3113.2243 3115.6306 3117.2637 3137.8903 3146.8318 3149.5793 3151.6620 3168.1588 3177.6248 3188.3943 3194.5736 3204.8230 3211.2667
redmass: 3.6048 3.7443 5.9265 3.7240 5.3294 3.8392 5.4779 4.8560 4.4511 4.7828 3.8273 5.5882 1.9153 2.6455 2.6824 2.4656 2.1628 4.2384 3.8098 3.3664 4.8053 4.9458 6.3665 3.0679 6.5048 6.1338 1.9369 2.0925 3.1715 2.2473 2.4056 1.9865 3.1911 3.2008 3.7632 1.2583 1.2508 1.2631 2.0313 1.7566 1.4758 1.3951 1.6925 1.4114 1.3945 1.3840 1.3978 5.8523 1.3369 3.0244 5.3263 1.3664 2.2492 2.5470 1.6181 1.6476 3.9249 1.3388 1.0984 1.0523 1.0924 1.1303 1.2377 2.9527 1.1441 3.2387 1.9609 1.2516 1.4329 1.3005 1.2747 1.2470 1.5013 3.0700 7.8126 5.2492 2.7371 2.1540 1.3335 1.2155 2.2520 1.9412 1.4784 2.3591 5.8967 6.5428 6.0138 6.1594 6.2245 5.1823 1.0597 1.0596 1.1032 1.1043 1.0923 1.0892 1.0889 1.0877 1.0897 1.0946 1.0954 1.0962 1.1014 1.0906 1.0905 1.0956 1.0984 1.1031
irintensity: 0.0371 0.0514 2.2233 0.0455 1.0454 0.0946 0.9111 0.1222 0.5350 4.6545 0.3335 0.9911 0.0126 0.0675 0.0396 0.0058 0.0544 0.8723 15.7768 9.6986 3.4693 1.2716 0.0001 40.6578 0.0497 0.1733 58.2945 36.8976 8.5430 127.6778 45.1294 15.5375 3.3361 4.6261 6.5091 0.0158 0.0206 0.6720 18.4354 0.5053 2.9586 2.3009 0.0027 0.3443 0.0184 0.3587 0.0720 1.5791 0.1042 4.3868 6.9252 0.0063 6.0606 1.6151 6.5422 0.0964 70.1755 21.9455 1.2681 0.0328 0.5852 0.4261 13.0104 0.8859 0.0827 20.7286 10.7196 0.4508 8.6928 0.0676 0.6837 15.7765 1.5770 0.0022 0.0791 0.0442 11.8141 7.1938 24.8217 20.9380 49.0959 23.6012 27.6348 5.2783 0.3291 0.0120 2.2105 38.0051 18.7915 21.1506 23.5139 15.5694 6.5475 0.0464 10.9586 27.0105 4.8014 12.1762 4.2396 6.4385 36.1949 2.1188 16.7458 0.1936 0.0034 0.9880 1.9444 0.1321
temp: 298.150 k
press: 1.00000 atm
elementType: 7 6 6 6 6 6 6 6 6 6 6 6 6 6 6 6 6 6 6 6 1 1 1 1 1 1 1 1 1 1 1 1 1 1 1 1 1 1
symmnumber: 1
zpe: 827474.8 jmol-1
zpe.correction: 0.315169 hartree
zpe.thermalcorrener: 0.329950 hartree
zpe.thermalcorrenthalpy: 0.330894 hartree
zpe.thermalcorrgfe: 0.271468 hartree
zpe.sumelectzpe: -787.952768 hartree
zpe.sumelectthermal: -787.937987 hartree
zpe.sumelectthermalent: -787.937043 hartree
zpe.sumelectthermalfe: -787.996468 hartree
dipole: 13.3899 1.9493 -0.0004
dipole: 13.5310
quadrupole: -47.8719 -93.9487 -90.4125
quadrupole: 12.8457 0.0045 -0.0003
quadrupole: 29.5391 -16.5377 -13.0015 12.8457 0.0045 -0.0003
hfenergy: -788.2679366 hartree
pointgroup: C01 [X(C19H18N1)]
dipole: 5.2662495 -0.7787733 -0.0002493 debye
polarizability: 218.9220074|-0.316537|187.3499457|-0.0199761|-0.0019655|196.1891935 unknown
InChI: InChI=1S/C19H18N/c1-3-7-17(8-4-1)15-18-9-11-19(12-10-18)16-20-13-5-2-6-14-20/h1-14H,15-16H2
charge 1 multiplicity 1
38 atoms
N  3.513984 0.177433 0.000115
C  1.470293 1.659034 0.000485
C  -1.387073 1.701292 0.000222
C  2.985579 1.615291 0.000628
C  -2.913851 1.682815 0.000078
C  0.751233 1.679539 -1.221348
C  0.750996 1.678871 1.222191
C  -0.657922 1.699901 -1.218013
C  -0.658156 1.69924 1.218597
C  -3.473143 0.254707 0.000019
C  3.714679 -0.470379 -1.194367
C  3.71441 -0.47133 1.194128
C  -3.729049 -0.420739 1.220169
C  -3.728461 -0.420861 -1.220188
C  4.131508 -1.808998 -1.220155
C  4.131234 -1.809967 1.218941
C  -4.225289 -1.743862 1.22217
C  -4.224702 -1.743982 -1.222297
C  4.343705 -2.493894 -0.000855
C  -4.471854 -2.410998 -0.00009
H  3.411772 2.09994 -0.89348
H  3.411571 2.099232 0.895213
H  -3.285838 2.223028 -0.8892
H  -3.286009 2.223008 0.889299
H  1.287611 1.706823 -2.178994
H  1.287195 1.705621 2.179952
H  -1.200436 1.728626 -2.169439
H  -1.200852 1.727437 2.169934
H  3.532135 0.108025 -2.101985
H  3.53166 0.10635 2.102167
H  -3.559284 0.09512 2.173878
H  -3.558221 0.094901 -2.173865
H  4.287135 -2.299465 -2.183679
H  4.286645 -2.301202 2.182109
H  -4.432187 -2.247973 2.172607
H  -4.431142 -2.248187 -2.172785
H  4.669032 -3.537967 -0.001232
H  -4.865708 -3.433031 -0.000134
