program: Gaussian 09
title: 000114665
version: EM64L-G09RevD.01
frameworkgroup: C1[X(C20H18Cl5NO4)]
method: RPBEPBE
basis: SDD
operation: Freq
keyword: #p
keyword: freq=noraman
keyword: PBEPBE/SDD
title: #p freq=noraman PBEPBE/SDD
converged: YES YES NO NO
title: Mulliken charges:
elementType: Cl Cl Cl Cl Cl O O O O N C C C C C C C C C C C C C C C C C C C C H H H H H H H H H H H H H H H H H H
charge: 0.053571 0.068668 0.066062 0.063812 0.070873 -0.293295 -0.160256 -0.286381 -0.304735 -0.386493 -0.019927 -0.206484 -0.387562 -0.731943 -0.707832 0.178749 0.317190 0.770342 -0.475797 0.465556 -0.328078 -0.303803 -0.092093 -0.087014 -0.385451 -0.366810 -0.123245 -0.226269 -0.229425 -0.232820 0.233497 0.299514 0.201097 0.216956 0.223309 0.224813 0.226340 0.340567 0.215769 0.220204 0.219979 0.222366 0.244523 0.233406 0.272190 0.227558 0.228800 0.230000
chargesum: 0.00000
title: Mulliken charges with hydrogens summed into heavy atoms:
elementType: Cl Cl Cl Cl Cl O O O O N C C C C C C C C C C C C C C C C C C C C
charge: 0.053571 0.068668 0.066062 0.063812 0.070873 -0.293295 -0.160256 -0.286381 -0.304735 -0.045926 0.213570 0.093030 0.030491 -0.057482 -0.051879 0.178749 0.317190 0.770342 -0.008908 0.465556 -0.328078 -0.303803 -0.092093 -0.087014 -0.152044 -0.094620 -0.123245 0.001289 -0.000624 -0.002820
polarizability: 3.76585931e+02 -2.29725552e+01 2.63557018e+02 2.04847000e+01 3.06586795e+01 2.28434234e+02
1716.lowfreq: -8.9845 -2.5153 0.0014 0.0018 0.0020 2.8833 4.9408 9.0111 14.1341
frequency: -7.2796 8.4880 14.0694 26.2873 32.3939 36.2321 38.4247 42.4124 54.0762 61.1550 68.4374 76.8472 78.7975 100.8878 107.0709 134.3204 157.0113 160.1234 184.3720 198.1172 200.0038 201.2683 202.4101 213.7851 222.5660 229.0138 248.9520 274.1359 292.8453 299.7490 316.6911 319.0454 320.5814 327.1087 344.0279 351.9828 360.8256 396.4135 404.5335 413.9141 449.3978 483.7684 523.2028 545.5064 558.6913 591.7504 592.8985 599.7028 612.9909 617.3393 643.1492 662.6755 666.5890 699.3429 705.7618 707.5986 729.3774 754.7977 766.7685 789.3066 803.1852 806.6576 816.0068 823.5919 858.3413 865.9306 922.9341 935.6454 940.0426 955.2282 966.5353 981.4399 984.9807 990.4250 994.6354 1001.1772 1027.0587 1039.3359 1059.3255 1068.9376 1091.1275 1096.5514 1131.3868 1169.6518 1173.5215 1178.5662 1189.3004 1205.3130 1221.2404 1229.2124 1236.9408 1244.0385 1276.2209 1287.7048 1318.9508 1328.9513 1330.3337 1337.9305 1338.8044 1346.9727 1352.6151 1356.0051 1385.5216 1389.0070 1396.6964 1442.1568 1461.3793 1464.7293 1472.2723 1482.0026 1483.2336 1484.4596 1487.5130 1488.0532 1535.0093 1544.9254 1594.3761 1614.6528 1648.1254 1682.9472 2963.7609 2980.8421 2986.4525 2991.0308 3002.8314 3019.4781 3038.2158 3075.4818 3079.0950 3080.8548 3089.8956 3112.3593 3119.7878 3128.2414 3140.7406 3151.9185 3165.1947 3578.1090
redmass: 5.4343 10.1524 7.0266 5.7943 5.3257 8.6044 9.5039 5.0981 2.4713 3.1578 28.6382 5.9099 16.2645 6.2995 6.6686 5.3210 5.0975 6.6240 6.0072 3.4271 1.5367 27.8582 5.4765 34.6886 9.1485 1.3645 5.5599 4.6279 5.8906 4.5001 9.4613 7.4250 6.0591 21.8099 3.6001 6.6477 15.2689 3.3608 2.8290 2.5379 5.7625 4.5342 3.4365 4.1378 1.8838 9.5294 11.9579 3.9064 12.6362 6.2683 4.6683 6.6118 6.5765 5.1064 2.1599 8.9560 10.9302 2.1849 1.5821 8.4230 1.7828 7.6571 3.4511 12.8539 1.2605 4.7604 4.4062 1.7031 2.3216 2.2163 1.3168 1.6798 1.8223 4.5022 2.1549 1.3382 2.2097 2.4749 7.6173 2.3482 1.5297 8.6409 2.1624 2.1516 1.0561 3.6984 1.1359 2.2088 2.8558 11.4839 1.1585 1.2799 1.2103 1.2151 1.3199 11.7375 1.2577 1.3751 11.9684 1.3295 1.5412 7.2413 8.0208 1.2192 1.1968 2.1747 1.1320 1.0748 1.0454 1.1231 1.0513 2.1422 1.1332 1.5971 11.9870 11.9111 6.0824 6.0721 8.8403 12.6973 1.0590 1.0361 1.0365 1.0839 1.0823 1.1000 1.0587 1.0996 1.0999 1.0998 1.0988 1.1072 1.0868 1.0874 1.0921 1.0963 1.1015 1.0773
irintensity: 0.3313 0.0931 0.0356 0.2411 0.1855 0.1713 0.3838 0.9974 0.4391 0.3403 0.0352 6.7672 1.2325 0.9288 2.0879 0.2959 0.7702 1.4636 0.7961 0.2338 0.0484 0.1066 0.1049 0.0033 0.5689 0.2340 15.3473 7.8219 2.0339 0.9740 0.2753 0.6207 0.3820 0.0626 2.5992 2.4046 0.8461 12.8492 0.2851 5.5139 6.8403 32.7004 15.0601 13.7931 101.3721 5.8744 0.2972 3.2546 9.4183 0.7686 32.1368 38.7773 27.9672 33.0291 60.9361 29.6054 10.6881 44.6924 21.4379 67.8386 27.6764 71.6178 14.5375 0.6799 0.9605 114.3648 133.5110 25.3056 65.8472 49.4142 12.5166 23.4480 47.1119 0.0669 51.9112 1.1851 6.5417 90.5501 116.7501 43.3360 17.4319 302.7288 1.7253 9.0304 0.1317 140.6440 2.6632 211.3275 25.4029 7.9581 8.4602 15.9413 6.1001 41.7952 37.4581 121.1608 2.4749 0.8970 35.8605 9.8204 29.7089 241.4874 0.7222 11.1125 13.5239 9.3390 12.5499 5.9770 14.6713 64.5980 22.7078 5.9590 84.8535 319.1868 1.2236 3.6883 2.0871 0.4246 218.0333 136.4771 26.6094 29.9740 23.6836 6.0592 25.7721 30.5684 32.3034 26.7114 35.8737 51.4553 31.8391 4.8583 5.5925 2.1428 20.2974 24.0790 22.1362 35.5008
temp: 298.150 k
press: 1.00000 atm
elementType: 17 17 17 17 17 8 8 8 8 7 6 6 6 6 6 6 6 6 6 6 6 6 6 6 6 6 6 6 6 6 1 1 1 1 1 1 1 1 1 1 1 1 1 1 1 1 1 1
symmnumber: 1
zpe: 892797.6 jmol-1
zpe.correction: 0.340049 hartree
zpe.thermalcorrener: 0.370540 hartree
zpe.thermalcorrenthalpy: 0.371485 hartree
zpe.thermalcorrgfe: 0.272666 hartree
zpe.sumelectzpe: -3426.666292 hartree
zpe.sumelectthermal: -3426.635800 hartree
zpe.sumelectthermalent: -3426.634856 hartree
zpe.sumelectthermalfe: -3426.733675 hartree
dipole: -2.1560 1.3944 2.0698
dipole: 3.2980
quadrupole: -199.5953 -205.6228 -208.6693
quadrupole: -6.4767 -2.3215 -3.2049
quadrupole: 5.0338 -0.9937 -4.0401 -6.4767 -2.3215 -3.2049
hfenergy: -3427.0063402 hartree
pointgroup: C01 [X(C20H18Cl5N1O4)]
dipole: 0.7543831 0.1956813 1.037402 debye
polarizability: 370.3735163|-38.8648601|217.8264594|12.8739857|-17.9913323|280.3772062 unknown
InChI: InChI=1S/C20H18Cl5NO4/c1-3-10(2)17(26-20(28)29-9-11-7-5-4-6-8-11)19(27)30-18-15(24)13(22)12(21)14(23)16(18)25/h4-8,10,17,26H,3,9H2,1-2H3
charge 0 multiplicity 1
48 atoms
Cl -3.395256 -0.433483 2.105303
Cl -2.102289 0.533473 -3.169547
Cl -5.128946 1.520441 -3.757821
Cl -6.424919 0.572333 1.57571
Cl -7.284408 1.541666 -1.370466
O  -1.626717 -0.251271 -0.306976
O  -1.966747 -2.418859 -1.148246
O  2.402307 1.223185 -0.105821
O  2.463185 -0.417069 -1.807641
N  0.979926 -0.541814 0.008577
C  0.542154 -2.998552 0.480415
C  0.310282 -1.752863 -0.450376
C  0.015694 -2.742138 1.918603
C  2.035604 -3.389755 0.453434
C  0.003023 -4.007383 2.803963
C  -1.188333 -1.569108 -0.697341
C  1.9870 0.039003 -0.73302
C  -2.961387 0.109308 -0.573686
C  3.570495 1.917852 -0.752265
C  4.890119 1.409481 -0.213328
C  -3.907829 0.120187 0.473592
C  -3.337524 0.53957 -1.866502
C  -4.657823 0.975022 -2.113827
C  -5.229296 0.558485 0.235895
C  5.502262 2.03927 0.900091
C  5.530841 0.295804 -0.816832
C  -5.605243 0.985069 -1.060967
C  6.73172 1.563547 1.408144
C  6.759823 -0.180597 -0.309443
C  7.363134 0.451606 0.803343
H  -0.054666 -3.820424 0.034765
H  0.750996 -1.992307 -1.439402
H  0.640866 -1.963739 2.402287
H  -1.01612 -2.338595 1.868417
H  2.210345 -4.310985 1.035372
H  2.385024 -3.570844 -0.579181
H  2.661726 -2.587671 0.885542
H  0.629147 -0.036405 0.822258
H  -0.594892 -4.811278 2.33508
H  1.0215 -4.397994 2.97732
H  -0.441573 -3.790089 3.792045
H  3.398402 2.973987 -0.49249
H  3.48825 1.768118 -1.842316
H  5.013546 2.902015 1.369741
H  5.052374 -0.195853 -1.671279
H  7.197572 2.058682 2.267506
H  7.248141 -1.040105 -0.78211
H  8.318511 0.083373 1.194179
