program: Gaussian 09
title: 000115311
version: EM64L-G09RevD.01
frameworkgroup: C1[X(C11H18N5O13P3)]
method: RPBEPBE
basis: SDD
operation: Freq
keyword: #p
keyword: freq=noraman
keyword: PBEPBE/SDD
title: #p freq=noraman PBEPBE/SDD
converged: YES YES NO NO
title: Mulliken charges:
elementType: P P P O O O O O O O O O O O O O N N N N N C C C C C C C C C C C H H H H H H H H H H H H H H H H H H
charge: 1.526024 1.532196 1.470977 -0.399493 -0.439668 -0.618736 -0.758961 -0.226226 -0.646777 -0.620373 -0.862969 -0.658100 -0.542603 -0.682753 -0.697917 -0.554964 -0.192018 -0.030641 -0.137214 -0.105814 -0.589698 -0.138480 -0.057620 0.008602 -0.529392 -0.280614 0.240210 -0.216051 -0.155129 0.158287 0.004078 -0.505028 0.244911 0.290055 0.253884 0.280180 0.290279 0.300781 0.240998 0.352381 0.275427 0.415382 0.321466 0.381413 0.239447 0.240110 0.239925 0.421577 0.456965 0.461681
chargesum: 0.00000
title: Mulliken charges with hydrogens summed into heavy atoms:
elementType: P P P O O O O O O O O O O O O O N N N N N C C C C C C C C C C C
charge: 1.526024 1.532196 1.470977 -0.399493 -0.087287 -0.618736 -0.758961 -0.226226 -0.231395 -0.620373 -0.862969 -0.236524 -0.542603 -0.225788 -0.236236 -0.554964 -0.192018 -0.030641 -0.137214 -0.105814 0.113181 0.106431 0.232436 0.262486 0.041067 0.261166 0.240210 0.059375 -0.155129 0.158287 0.004078 0.214454
polarizability: 2.91186867e+02 3.67431899e+01 2.53780264e+02 4.45308208e+00 -1.19329890e+01 2.61659819e+02
1716.lowfreq: -2.8501 -0.0014 -0.0012 -0.0008 3.2868 8.1670 22.9167 25.6244 46.2840
frequency: 22.8463 25.4660 46.2118 49.4112 54.5746 61.2895 72.8812 80.6123 94.4794 95.7214 106.7015 108.8154 116.4027 122.9243 133.2526 140.1235 153.1251 155.4612 163.0739 170.3870 182.8609 191.7789 198.1666 214.4688 219.8716 230.0012 234.7616 241.1536 244.7450 254.7477 270.5714 280.8902 297.6595 310.2054 315.4511 318.3152 330.3845 337.9212 345.6292 349.8171 372.3185 382.2483 394.3354 401.6446 404.2968 417.5473 427.3552 462.1592 478.9872 481.6953 501.8601 525.3708 548.9607 552.9180 583.7871 627.7852 634.0258 657.3333 665.2337 684.7199 695.4075 698.4855 708.1690 720.2909 729.8328 740.7572 754.2893 770.1136 775.1392 779.7997 797.2688 800.1839 817.0031 843.0863 853.8667 867.1738 892.8057 899.5332 922.6987 932.4076 938.5973 973.0371 984.7263 1006.9963 1009.4775 1018.3422 1027.1059 1039.7533 1060.0488 1076.6772 1083.6587 1084.6820 1095.8316 1107.7771 1112.4374 1149.3975 1155.7898 1165.0894 1195.5337 1202.4860 1214.9622 1232.7898 1246.5660 1262.0700 1283.5237 1289.8474 1296.2368 1320.8113 1331.6052 1332.1580 1360.9682 1365.0465 1367.6660 1382.4648 1397.8153 1417.2404 1442.8641 1451.2863 1451.8171 1457.4835 1459.6576 1462.8205 1516.6046 1541.9226 1582.5780 1648.0640 2661.0343 2973.3374 3000.2182 3005.7667 3039.6969 3048.6185 3058.9373 3071.0071 3109.2575 3124.8431 3150.5315 3165.2307 3225.9538 3420.6903 3566.9250 3579.1822 3595.9674 3644.2666
redmass: 8.7247 7.9882 9.9120 8.8581 5.9087 8.8259 8.2055 10.7237 6.0668 10.0681 7.1846 9.1712 4.8917 4.4592 5.0950 1.9003 1.8916 5.4822 5.2256 3.0346 3.3916 5.0464 6.2100 5.4700 6.0695 6.1970 3.0805 8.0495 3.7623 7.8403 3.9637 3.0079 1.4173 3.8521 3.2721 5.0272 4.3836 6.7341 8.4163 7.3541 6.9305 5.9974 3.7281 6.2986 7.8495 6.2560 6.6756 3.0431 7.6059 8.1130 5.3353 5.3799 1.1653 6.2859 5.5150 4.6647 1.6681 6.4120 4.9189 2.8638 5.0606 4.0779 5.0182 9.1707 4.2929 3.1111 3.3489 5.1654 2.6631 11.4024 3.4074 3.4975 5.7615 5.4270 4.2217 7.9796 3.0631 4.7999 1.6947 4.2289 2.3816 2.2430 5.6500 1.3786 1.4707 2.9902 2.9256 2.9520 6.0098 3.2787 2.1800 3.1884 7.8806 3.0176 1.2536 1.6440 1.4018 1.6901 1.6568 1.3881 2.1538 2.9428 1.2981 1.2045 1.3023 2.3920 1.5279 1.4154 1.3397 3.5618 1.2050 1.5723 2.2071 3.2451 2.0751 1.2395 1.8010 1.0584 2.1270 1.3455 1.0879 1.0838 4.1861 7.6372 9.2795 1.2947 1.0763 1.0628 1.0859 1.0292 1.0872 1.0646 1.0864 1.1054 1.1046 1.1045 1.1050 1.0686 1.0986 1.0567 1.0666 1.0667 1.0669 1.0936
irintensity: 1.0914 0.1695 0.8667 0.4666 3.1818 1.0517 2.2468 0.2351 3.7701 0.2055 5.4566 1.5318 2.3560 9.7556 3.6805 1.2184 0.7626 9.4458 19.0257 46.1217 3.4576 4.0933 10.5298 12.2377 1.3711 3.3972 50.2341 9.9357 69.5520 15.5974 11.1597 52.5890 102.5794 3.5273 78.5512 22.2688 14.4146 15.5219 54.2741 86.2856 38.2339 23.6988 23.6839 20.5430 62.9167 9.8073 23.6252 43.5681 4.8289 33.5548 11.3205 6.7361 13.8800 27.6095 24.2582 7.9368 62.0924 5.1718 15.7801 119.1238 56.8087 141.5268 107.1531 107.2891 91.4151 67.6602 301.4502 0.7743 121.4218 360.6162 39.9560 34.0158 44.8123 59.3623 186.0935 239.8598 7.2744 13.7859 221.6889 175.8656 150.2874 39.3946 4.1886 49.3831 50.0163 67.3327 90.6205 32.2704 97.7315 95.2244 23.5320 62.3519 213.2935 53.5074 0.0813 18.7398 20.3986 35.9662 73.4146 52.5302 47.8088 300.7732 1.5741 5.5699 0.4710 5.9113 13.2778 1.5634 18.5281 50.9425 83.0420 52.1577 99.1293 94.8071 19.8993 1.9058 22.1153 12.8192 12.3417 19.1316 12.6371 49.7147 158.5335 397.9179 269.6474 251.5035 1880.2538 64.5102 33.9699 45.4362 8.2641 6.5010 10.1606 11.4767 25.1031 1.9911 18.6381 581.3462 0.6622 323.6527 14.7895 101.3422 115.1841 102.4686
temp: 298.150 k
press: 1.00000 atm
elementType: 15 15 15 8 8 8 8 8 8 8 8 8 8 8 8 8 7 7 7 7 7 6 6 6 6 6 6 6 6 6 6 6 1 1 1 1 1 1 1 1 1 1 1 1 1 1 1 1 1 1
symmnumber: 1
zpe: 888776.5 jmol-1
zpe.correction: 0.338517 hartree
zpe.thermalcorrener: 0.372430 hartree
zpe.thermalcorrenthalpy: 0.373374 hartree
zpe.thermalcorrgfe: 0.273913 hartree
zpe.sumelectzpe: -2702.865672 hartree
zpe.sumelectthermal: -2702.831760 hartree
zpe.sumelectthermalent: -2702.830816 hartree
zpe.sumelectthermalfe: -2702.930277 hartree
dipole: -3.6075 4.5380 7.5575
dipole: 9.5249
quadrupole: -223.3350 -192.9893 -221.1482
quadrupole: 22.0498 17.0530 -3.5790
quadrupole: -10.8442 19.5015 -8.6573 22.0498 17.0530 -3.5790
hfenergy: -2703.2041896 hartree
pointgroup: C01 [X(C11H18N5O13P3)]
dipole: 0.5137085 -1.8882907 -3.1958244 debye
polarizability: 299.5634414|-14.9911932|240.3765262|16.4984429|-22.9096682|266.6869825 unknown
InChI: InChI=1S/C11H18N5O13P3/c1-25-10-8-9(14-11(12)15-10)16(4-13-8)7-2-5(17)6(27-7)3-26-31(21,22)29-32(23,24)28-30(18,19)20/h4-7,17-19,21,23H,2-3,12H2,1H3
charge 0 multiplicity 1
50 atoms
P  1.623404 2.232927 -1.260384
P  -0.318796 2.650848 1.257359
P  2.163869 1.514622 3.145493
O  1.397442 -1.280279 1.074019
O  3.22021 -3.702959 0.765625
O  2.492262 1.030063 -0.377342
O  0.159559 2.579829 -0.441421
O  -4.939592 -0.467622 -0.926141
O  2.675461 3.514077 -0.880445
O  1.390181 1.871906 -2.783045
O  1.193598 2.392075 1.914687
O  -1.11055 1.149209 1.46649
O  -1.14986 3.951166 1.574422
O  1.409222 0.024751 3.272757
O  3.505175 1.320156 2.109615
O  2.389937 2.29369 4.487833
N  -0.846189 -2.068058 0.605113
N  -3.084208 -1.850397 1.093974
N  -0.768389 -0.781344 -1.525507
N  -3.006531 -0.002163 -2.198482
N  -1.107484 0.572212 -3.430212
C  2.676294 -2.808909 -0.260399
C  2.62251 -1.336305 0.234596
C  0.523443 -2.479044 0.804423
C  1.19302 -3.182403 -0.396885
C  2.50495 -0.359699 -0.936903
C  -1.40158 -1.324158 -0.451064
C  -1.910341 -2.327101 1.509871
C  -2.790531 -1.225653 -0.136961
C  -3.583995 -0.555005 -1.111026
C  -1.632587 -0.09188 -2.353322
C  -5.716948 0.238616 -1.972197
H  3.233463 -2.90474 -1.213179
H  3.47107 -1.07845 0.893625
H  0.562149 -3.102068 1.714004
H  1.063054 -4.273332 -0.342132
H  0.772047 -2.807366 -1.343768
H  1.5609 -0.53506 -1.48821
H  3.379099 -0.435259 -1.608403
H  4.171944 -3.492834 0.942636
H  -1.744968 -2.870809 2.43831
H  2.305172 4.430139 -0.959503
H  -1.76062 1.109825 -3.996709
H  -0.114933 0.837632 -3.424922
H  -6.755335 0.180079 -1.61741
H  -5.596264 -0.264632 -2.945786
H  -5.380805 1.285123 -2.060882
H  -2.091502 1.19667 1.609397
H  1.36515 -0.54274 2.397926
H  3.270021 1.402653 1.126365
