program: Gaussian 09
title: 000113997
version: EM64L-G09RevD.01
frameworkgroup: C1[X(C11H11ClN2)]
method: RPBEPBE
basis: SDD
operation: Freq
keyword: #p
keyword: freq=noraman
keyword: PBEPBE/SDD
title: #p freq=noraman PBEPBE/SDD
converged: NO YES NO NO
title: Mulliken charges:
elementType: Cl N N C C C C C C C C C C C H H H H H H H H H H H
charge: -0.061640 -0.353626 -0.075014 0.412643 -0.046769 0.119330 -0.308728 -0.285482 -0.308847 -0.391701 -0.325400 -0.262061 -0.222148 -0.615993 0.216310 0.239176 0.237744 0.319838 0.224617 0.228849 0.258535 0.226785 0.268148 0.278224 0.227210
chargesum: 0.00000
title: Mulliken charges with hydrogens summed into heavy atoms:
elementType: Cl N N C C C C C C C C C C C
charge: -0.061640 -0.033787 -0.075014 0.412643 -0.046769 0.119330 -0.070984 0.170004 -0.084229 -0.162852 -0.066865 -0.035276 0.005062 -0.069621
polarizability: 2.41401875e+02 1.55278355e+01 1.45233274e+02 1.65645718e+00 -6.19640248e-01 6.72198275e+01
1716.lowfreq: -7.2428 0.0020 0.0025 0.0027 3.2301 7.8594 26.3267 51.3396 78.8385
frequency: 26.0805 51.2979 78.8262 122.5202 151.1795 174.2371 250.1217 294.0642 314.8888 368.1779 398.7229 452.5095 469.8676 518.1869 533.3375 561.3221 587.2334 611.7542 613.1351 683.1769 736.7083 750.7981 761.5415 787.8665 817.7041 843.1854 875.8660 902.0212 936.7515 951.2336 970.9853 981.4247 989.3037 1016.8473 1036.8148 1109.2982 1138.8140 1153.4515 1166.2220 1186.4307 1227.7830 1237.2640 1254.6225 1286.7016 1301.3305 1341.6113 1346.9323 1385.2978 1408.7531 1417.3135 1442.0799 1443.6766 1470.5924 1502.0720 1517.6833 1552.4124 1611.0972 1627.2995 2936.6047 2986.7594 3067.3721 3116.8843 3127.5256 3132.4423 3153.2631 3154.3805 3163.8376 3168.6184 3520.2214
redmass: 6.3113 5.1816 5.2874 4.0553 5.8371 4.1324 2.3826 5.2024 3.9018 4.4553 3.3591 3.5197 2.7903 6.9080 2.4620 4.8323 2.1281 4.2192 3.2515 2.6342 3.1525 5.7418 1.3967 3.4415 1.5329 2.5497 1.6398 3.8549 2.9328 1.3401 1.4059 1.8378 1.3231 2.1555 1.7334 1.9297 2.1209 1.2171 1.0957 1.3267 1.3487 1.8645 1.6351 1.6740 1.2544 2.2357 2.3491 2.1357 5.2719 2.3034 1.1134 2.1411 1.0886 2.7341 3.9283 6.0300 6.2507 6.8930 1.0613 1.0981 1.0576 1.0874 1.0889 1.0886 1.1116 1.0948 1.0959 1.0991 1.0759
irintensity: 0.2541 2.8207 4.4495 0.5737 2.2738 3.1642 1.9768 0.6084 2.2375 6.8207 0.1898 1.8761 21.4921 0.2160 14.0098 18.4559 58.1047 28.8663 32.3474 15.2948 13.6071 1.4319 38.8935 7.2520 92.4333 0.4138 0.3743 3.3153 6.1378 0.8096 5.0145 39.3452 0.2044 7.8442 1.2972 4.9596 12.4819 5.0574 4.5693 10.4345 42.2583 11.2559 8.5269 5.7734 19.9511 48.6083 50.8371 14.5221 1.3908 125.4571 13.7155 6.3524 63.0663 36.6916 267.6409 82.1108 303.5943 121.7240 86.0619 20.3338 24.8852 6.3271 9.3812 13.9884 12.9698 29.0995 27.7738 20.6636 70.7431
temp: 298.150 k
press: 1.00000 atm
elementType: 17 7 7 6 6 6 6 6 6 6 6 6 6 6 1 1 1 1 1 1 1 1 1 1 1
symmnumber: 1
zpe: 516047.1 jmol-1
zpe.correction: 0.196552 hartree
zpe.thermalcorrener: 0.208620 hartree
zpe.thermalcorrenthalpy: 0.209564 hartree
zpe.thermalcorrgfe: 0.156489 hartree
zpe.sumelectzpe: -994.349232 hartree
zpe.sumelectthermal: -994.337164 hartree
zpe.sumelectthermalent: -994.336220 hartree
zpe.sumelectthermalfe: -994.389295 hartree
dipole: 0.7699 3.6698 0.6074
dipole: 3.7986
quadrupole: -80.3233 -81.0848 -93.2761
quadrupole: 8.4122 4.8556 -0.6539
quadrupole: 4.5714 3.8099 -8.3813 8.4122 4.8556 -0.6539
hfenergy: -994.5457841 hartree
pointgroup: C01 [X(C11H11Cl1N2)]
dipole: 0.4239576 1.4009251 0.3018287 debye
dipolederiv: -0.3539543 0.0887496 0.0226644 0.2343188 -0.4243496 -0.1060774 0.1107825 -0.1486702 -0.24829 -2.0905861 0.001169 -0.0441379 0.4568803 -0.2253107 0.0668827 -0.3928841 0.0510836 -0.4870124 -1.2953942 0.1028564 -0.0340395 -0.4370546 -0.3285997 -0.0101073 -0.0199847 0.0079706 -0.2750766 -0.4161627 -0.0433923 -0.0120998 -0.0811399 -0.3186022 0.0183811 -0.0127704 0.0183641 0.0498638 0.8261491 -0.0890605 0.0297061 0.1272307 0.0821934 0.0017989 0.0311096 -0.0090919 0.0585224 2.2390471 -0.1591326 0.0842836 -0.6222392 0.2247916 -0.0203987 0.1788964 -0.0018595 0.1851804 0.5459923 0.1300604 0.0156376 0.1120482 0.2583894 -0.017502 0.0197533 -0.0214091 -0.1335009 0.7047191 0.1930506 -0.0898351 0.7157503 0.1435471 -0.0660153 0.0058716 -0.102232 0.2926968 -0.58276 -0.0396863 -0.0168979 0.5890212 -0.0687612 -0.000096 -0.0517755 -0.0064587 -0.1835689 0.289083 0.0906986 0.0089249 -0.0572067 0.1334626 -0.016447 0.0170654 -0.0135117 -0.1627478 -0.2486932 0.0308744 -0.0018239 -0.1179053 0.1137781 -0.0202999 0.0040184 -0.0128559 -0.1817589 -0.0758061 -0.1132113 0.0105573 -0.200361 -0.1965859 -0.0050052 0.0139815 -0.002328 -0.1848345 0.0018348 -0.0066949 0.0051697 0.1237582 0.1938047 -0.0135184 -0.0012966 -0.0175099 -0.1508635 0.326911 -0.187946 -0.0786365 -0.3808935 0.5821009 0.2170023 -0.1090897 0.2216685 0.2954755 -0.0009181 0.0980626 0.0438085 -0.087935 -0.0785565 -0.0951024 -0.0404393 -0.0734224 0.0259128 -0.1096038 -0.0209986 0.0095237 -0.2043203 0.0325941 0.0609133 0.1338169 0.117212 -0.1289053 0.0629653 0.0808538 -0.0074285 0.0304757 -0.0856233 0.0146706 -0.0060356 0.017978 0.1402227 0.2311224 -0.0377067 -0.0001726 -0.1320674 0.1532402 -0.0163875 0.0708953 -0.0351992 0.3001519 -0.0304605 -0.1196652 0.0039818 -0.1273526 -0.0043922 0.0121898 0.0052117 0.0051024 0.163537 0.046711 0.0253769 -0.0046577 0.1086224 -0.1057999 0.0168179 -0.0090736 0.0146265 0.1557646 0.0795061 0.0743201 -0.0066653 0.0157213 -0.0529426 0.0117888 -0.0039118 0.0130965 0.159323 -0.1467847 0.0379478 -0.0115496 0.0393491 0.0788985 0.0057481 -0.0116943 0.0056648 0.1663289 -0.0946065 -0.0448262 0.0173783 -0.0531535 -0.054838 -0.0483087 0.055446 -0.0312718 0.0815824 0.1207721 0.0247544 0.0558106 0.0740845 -0.0138406 0.0029564 0.0119811 -0.0028032 -0.0955016 -0.0290828 -0.1164541 0.0004979 -0.1256318 -0.0385981 0.0061159 0.0001262 0.0058566 0.1574982 unknown
polarizability: 243.3322407|7.1481118|143.221232|1.7078243|2.6589396|67.3015039 unknown
InChI: InChI=1S/C11H11ClN2/c12-7-8-13-11-6-5-9-3-1-2-4-10(9)14-11/h1-6,13H,7-8H2
charge 0 multiplicity 1
25 atoms
Cl 5.133547 -1.545336 -0.450213
N  2.27925 -0.242505 0.189472
N  0.042633 -0.866863 0.106523
C  -1.779302 0.817023 -0.044444
C  -1.302255 -0.549945 0.042341
C  0.947706 0.142668 0.091008
C  -0.786828 1.852628 -0.073667
C  3.424462 0.651561 0.048803
C  0.565305 1.534879 -0.011314
C  -3.185138 1.07351 -0.10389
C  -2.262605 -1.613358 0.063698
C  -4.100457 0.017102 -0.078967
C  -3.630909 -1.333038 0.004935
C  4.705129 0.002363 0.563883
H  3.267669 1.562652 0.664034
H  3.571798 0.988141 -1.000872
H  -1.10376 2.899513 -0.151805
H  2.445307 -1.250309 0.11475
H  1.321649 2.323737 -0.048679
H  -3.535468 2.111359 -0.169305
H  -1.88618 -2.638886 0.128349
H  -5.176633 0.215765 -0.123867
H  5.572568 0.66821 0.452608
H  4.604731 -0.354756 1.599308
H  -4.35622 -2.154517 0.023112
