program: Gaussian 09
title: 000016279
version: EM64L-G09RevD.01
frameworkgroup: C1[X(C12H16I2N2O)]
method: RPBEPBE
basis: SDD
operation: Freq
keyword: #p
keyword: freq=noraman
keyword: PBEPBE/SDD
title: #p freq=noraman PBEPBE/SDD
converged: YES YES NO NO
title: Mulliken charges:
elementType: I I O N N C C C C C C C C C C C C H H H H H H H H H H H H H H H H
charge: 0.033379 0.028606 -0.263456 -0.167909 -0.440054 0.472036 -0.375766 -0.378260 -0.355333 -0.341470 -0.761274 -0.761276 0.505110 -0.382312 -0.497983 0.208298 -0.800547 0.252334 0.256572 0.253756 0.253404 0.234092 0.235144 0.291176 0.316860 0.293347 0.314955 0.310120 0.218759 0.307570 0.237110 0.269140 0.233872
chargesum: 0.00000
title: Mulliken charges with hydrogens summed into heavy atoms:
elementType: I I O N N C C C C C C C C C C C C
charge: 0.033379 0.028606 -0.263456 -0.167909 -0.132484 0.472036 0.133140 0.128900 -0.121241 -0.106326 -0.153238 -0.152974 0.505110 -0.072192 -0.279224 0.208298 -0.060425
polarizability: 3.10325974e+02 -1.92856908e+00 2.61390579e+02 -6.95877161e+00 -2.49128653e+01 1.01867013e+02
1716.lowfreq: -98.9691 -5.7653 -4.6795 -3.6502 -0.0007 -0.0006 -0.0005 17.9066 21.8224
frequency: -98.9667 17.8394 21.7989 25.9621 35.7024 66.0053 74.6180 106.6512 109.8757 123.1794 138.0468 163.0995 189.6451 193.8914 251.2853 288.6632 306.5268 357.6007 392.6351 405.4455 424.0768 475.8247 499.1360 525.6552 549.4431 578.7976 613.5174 619.4389 631.6691 641.5344 722.2087 727.5267 747.8824 754.0581 806.2615 826.8577 832.9908 925.0265 928.7083 931.4033 940.6013 980.2630 981.8507 989.5199 1007.9719 1020.1151 1024.5242 1027.9174 1106.4539 1139.2594 1173.6054 1193.8907 1196.7325 1203.8801 1214.0558 1225.3264 1265.3303 1273.9495 1292.5681 1322.9794 1339.7567 1344.9729 1368.6215 1374.1328 1385.6609 1425.4244 1447.4769 1448.5006 1450.2772 1467.9816 1478.8395 1497.1023 1501.4211 1514.4099 1584.4402 1627.9136 1636.8998 2987.0256 3011.5964 3016.9612 3062.9991 3064.3222 3068.0737 3071.5626 3073.1286 3112.1405 3136.9722 3149.9697 3151.4741 3153.5694 3160.9091 3192.4533 3522.6604
redmass: 1.0405 15.8105 9.0757 7.5661 5.1006 3.9254 3.7343 3.6285 7.1804 4.6260 2.9518 4.6293 4.0505 4.2519 3.7672 3.5840 5.1147 4.6080 5.7588 2.9129 3.0271 4.5193 3.5002 2.4144 4.8592 3.0623 4.3543 4.5748 1.1779 5.7001 3.7865 3.6849 1.1268 1.2186 1.3674 4.5517 1.5437 2.0921 1.4408 4.1012 1.3280 1.3157 1.8482 2.1330 1.8902 5.1186 4.2252 1.6528 1.5892 1.4061 1.7258 1.1599 1.1627 1.2511 2.1124 2.4695 1.6820 1.5263 1.1927 1.4785 1.2262 1.3389 3.4111 1.2866 2.1706 3.0178 1.0980 1.1163 1.1597 1.0475 1.0889 1.1187 1.9780 2.8038 5.2326 5.1511 6.2619 1.0384 1.0602 1.0608 1.0594 1.0606 1.0975 1.0984 1.1033 1.0893 1.0977 1.1084 1.1105 1.0917 1.0928 1.0949 1.0763
irintensity: 0.0226 0.3985 0.3630 0.8286 7.0309 1.0716 5.1661 1.8358 0.3874 5.3736 1.0567 0.4702 10.7735 1.8351 2.9246 0.6353 8.7245 0.5690 9.4558 4.0260 2.7713 59.4208 0.7235 28.8802 69.2018 0.5212 9.0849 89.5840 68.3540 12.8999 1.7070 16.3639 5.6529 9.9632 32.2148 1.8248 62.4814 16.4367 4.2977 1.2891 1.0924 5.2551 33.9575 0.7957 14.8185 5.7296 9.6041 7.7661 88.3908 6.0716 101.5507 32.0565 60.6969 1.3376 58.2680 56.0970 84.5056 24.9913 12.5767 97.9545 12.5625 46.2444 77.3037 80.5668 18.9743 45.8527 16.3936 47.8450 14.8887 19.8289 25.4152 20.0425 166.1553 655.7825 48.3707 167.9878 36.5359 11.9739 28.6256 10.1305 7.0510 6.3393 12.4874 16.6654 9.1927 27.1482 7.4392 4.2022 4.8702 20.5350 16.5318 8.5273 11.1113
temp: 298.150 k
press: 1.00000 atm
elementType: 53 53 8 7 7 6 6 6 6 6 6 6 6 6 6 6 6 1 1 1 1 1 1 1 1 1 1 1 1 1 1 1 1
symmnumber: 1
zpe: 684508.8 jmol-1
zpe.correction: 0.260716 hartree
zpe.thermalcorrener: 0.278810 hartree
zpe.thermalcorrenthalpy: 0.279755 hartree
zpe.thermalcorrgfe: 0.208071 hartree
zpe.sumelectzpe: -673.349571 hartree
zpe.sumelectthermal: -673.331476 hartree
zpe.sumelectthermalent: -673.330532 hartree
zpe.sumelectthermalfe: -673.402215 hartree
dipole: 0.5484 -3.8800 1.1735
dipole: 4.0905
quadrupole: -136.5109 -133.8055 -133.1132
quadrupole: -26.1311 6.4443 -3.4933
quadrupole: -2.0344 0.6710 1.3633 -26.1311 6.4443 -3.4933
hfenergy: -673.6102863 hartree
pointgroup: C01 [X(C12H16I2N2O1)]
dipole: -0.4729711 -1.4692117 -0.4556402 debye
polarizability: 309.5384452|-6.8263213|262.5801925|-0.3561015|24.4819666|101.464928 unknown
InChI: InChI=1S/C12H16I2N2O/c1-10(17)15-11-2-4-12(5-3-11)16(8-6-13)9-7-14/h2-5,15H,6-9H2,1H3
charge 0 multiplicity 1
33 atoms
I  3.693233 4.305367 0.02005
I  4.667578 -3.602238 0.12313
O  -4.409464 1.322113 0.449139
N  2.156356 0.10151 -0.008932
N  -3.497872 -0.742982 -0.195583
C  0.751804 -0.091989 -0.053506
C  2.740563 1.368157 0.463475
C  3.086663 -0.962644 -0.419617
C  -0.15628 0.958138 0.27365
C  0.187313 -1.34813 -0.427719
C  2.828825 2.384819 -0.693497
C  3.347403 -1.926657 0.75624
C  -2.097658 -0.479473 -0.136265
C  -1.550966 0.775432 0.238361
C  -1.20584 -1.530651 -0.469211
C  -4.560364 0.118249 0.084457
C  -5.937505 -0.525653 -0.089099
H  3.753336 1.174521 0.859463
H  2.151258 1.783922 1.299332
H  4.040831 -0.508158 -0.740378
H  2.69321 -1.512613 -1.292498
H  0.213994 1.948012 0.556686
H  0.824474 -2.199715 -0.682999
H  3.502255 2.049178 -1.496366
H  1.843597 2.647054 -1.105457
H  3.881329 -1.441849 1.587309
H  2.428535 -2.407529 1.121494
H  -2.224668 1.595514 0.492608
H  -1.600578 -2.513209 -0.759772
H  -3.750858 -1.69221 -0.48078
H  -6.108335 -0.832333 -1.137867
H  -6.704153 0.210707 0.19044
H  -6.051916 -1.41836 0.553514
